{"text_format":"1","workbook":"xlsx","n_sheets":23,"sheets":["Light","Music","Heating","Entry","Main","Sensors","Distributors","Tree","Wireless","Other","Shading","Switch","Ms&Extensions","Calculation","Power","Sample Quote","Project information","Space","Products","News","Translating_general","Message Box","Translating_products"],"not_rendered":{"charts":0,"images":11,"macros":0,"external_links":0,"defined_names":2,"comments":2,"pivot_tables":0},"unopened":[],"bounds":{"document_bytes":16777216,"sheet_cells":100000,"rows_first":2000,"rows_last":500,"rows_between":2000,"halvings":0,"cell_chars":16384,"cell_head_chars":4096},"cells_cut":0,"cells_raw":0,"read":"whole","date_system":"1900"}

{"sheet":"Light","index":0,"n_rows":34,"n_cols":16,"rows_kept":34,"cut":false,"hidden":true,"merged":[]}
["Artikelnummer+","Bezeichnung","Preis excl.","Preis Inkl.","Notiz"]
["100012",{"$f":"Products!D12","v":"DMX Extension"},{"$f":"Products!E12","v":299},{"$f":"Products!F12","v":299}]
["100029",{"$f":"VLOOKUP(Main!C2,Translating_general!A101:P118,2,FALSE)","v":"Dimmer Channel (110V)"}]
["100117",{"$f":"Products!D27","v":"RGBW 24V Dimmer DMX"},{"$f":"Products!E27","v":82},{"$f":"Products!F27","v":82}]
["100125",{"$f":"Products!D29","v":"RGBW 24V Dimmer Air"},{"$f":"Products!E29","v":96},{"$f":"Products!F29","v":96}]
["200042",{"$f":"Products!D73","v":"RGB LED Strip 5m"},{"$f":"Products!E73","v":109},{"$f":"Products!F73","v":109}]
["200043",{"$f":"Products!D74","v":"Warm White LED Strip 5m"},{"$f":"Products!E74","v":109},{"$f":"Products!F74","v":109}]
["200046",{"$f":"Products!D75","v":"RGB LED Strip 5m IP68"},{"$f":"Products!E75","v":122},{"$f":"Products!F75","v":122}]
[100153.0,{"$f":"Products!D37","v":"Nano IO Air"},{"$f":"Products!E37","v":119},{"$f":"Products!F37","v":119}]
["200061",{"$f":"Products!D82","v":"Warm White LED Strip 5m IP65"},{"$f":"Products!E82","v":115},{"$f":"Products!F82","v":115}]
["200092",{"$f":"Products!D93","v":"Warm White LED Strip 5m IP68"},{"$f":"Products!E93","v":115},{"$f":"Products!F93","v":115}]
["200098",{"$f":"Products!D98","v":"RGBW LED Strip 5m IP20"},{"$f":"Products!E98","v":149},{"$f":"Products!F98","v":149}]
["200099",{"$f":"Products!D99","v":"RGBW LED Strip 5m IP65"},{"$f":"Products!E99","v":156},{"$f":"Products!F99","v":156}]
["200100",{"$f":"Products!D100","v":"RGBW LED Strip 5m IP68"},{"$f":"Products!E100","v":164},{"$f":"Products!F100","v":164}]
[200280.0,{"$f":"Products!D140","v":"LED Strip Accessories Set - RGBW"},{"$f":"Products!E140","v":19},{"$f":"Products!F140","v":19}]
[200278.0,{"$f":"Products!D141","v":"LED Strip Accessories Set - Warm White"},{"$f":"Products!E141","v":14},{"$f":"Products!F141","v":14}]
[null,{"$f":"VLOOKUP(Main!C2,Translating_general!A101:P118,3,FALSE)","v":"Analogue 1-10V"}]
[null,{"$f":"VLOOKUP(Main!C2,Translating_general!A101:P118,4,FALSE)","v":"Light Circut (switched )"}]
[100204.0,{"$f":"Products!D147","v":"LED Spot RGBW"},{"$f":"Products!E147","v":55},{"$f":"Products!F147","v":55}]
[100203.0,{"$f":"Products!D148","v":"LED Spot Warm White"},{"$f":"Products!E148","v":39},{"$f":"Products!F148","v":39}]
[null,{"$f":"VLOOKUP(Main!C2,Translating_general!A101:AK118,37,FALSE)","v":"Dali Channel"}]
[null,{"$f":"VLOOKUP(Main!C2,Translating_general!A101:AM118,39,FALSE)","v":"Circut (switched ) 16A"}]
[null,{"$f":"Products!D180","v":"LED Ceiling Spot RGBW"}]
[null,{"$f":"Products!D181","v":"LED Ceiling Spot WW"},null,null,null,null,null,null,null,null,null,null,{"$f":"VLOOKUP(Main!C2,Translating_general!A101:P118,5,FALSE)","v":"Light Circuit (dimmed 110V)"}]
[null,{"$f":"Products!D182","v":"LED Ceiling Spot Tree RGBW"},null,null,null,null,null,null,null,null,null,null,{"$f":"VLOOKUP(Main!C2,Translating_general!A101:P118,6,FALSE)","v":"Light Circuit (dimmed 0-10V)"},null,null,"DMX Dimmer 4 Kanal muss addiert werden"]
[null,{"$f":"Products!D183","v":"LED Ceiling Spot Tree WW"},null,null,null,null,null,null,null,null,null,null,{"$f":"VLOOKUP(Main!C2,Translating_general!A101:P118,7,FALSE)","v":"Light Circuit (24V 50W DMX)"},null,null,"Air Dimmer 4 Kanal muss addiert werden"]
[null,{"$f":"Products!D184","v":"LED Spot Tree WW"},null,null,null,null,null,null,null,null,null,null,{"$f":"VLOOKUP(Main!C2,Translating_general!A101:P118,8,FALSE)","v":"Light Circuit (24V 50W Air)"}]
[null,{"$f":"Products!D185","v":"LED Spot Tree RGBW"}]
[null,{"$f":"Products!D186","v":"RGBW 24V Dimmer Tree"}]
[null,null,null,null,null,null,null,null,null,null,null,null,"DMX Extension für Signal"]
[null,null,null,null,null,null,null,null,null,null,null,null,"DMX Dimmer für LED Streifen"]
[null,null,null,null,null,null,null,null,null,null,null,null,"Netzteil 4,2 Ampere"]
[null,null,null,null,null,null,null,null,null,null,null,null,"Pro Streifen 1 Dimmer"]
[null,null,null,null,null,null,null,null,null,null,null,null,"Dimmer einfach so auswählen"]

{"sheet":"Music","index":1,"n_rows":13,"n_cols":5,"rows_kept":13,"cut":false,"hidden":true,"merged":[]}
["Artikelnummer+","Bezeichnung","Preis excl.","Preis Inkl.","Notiz"]
[null,{"$f":"VLOOKUP(Main!$C$2,Translating_general!$A$101:$T$118,20,FALSE)","v":"Music Server Zone"}]
["100165",{"$f":"Products!D42","v":"Loxone Music Server 4 Zone"},{"$f":"Products!E42","v":1249},{"$f":"Products!F42","v":1249}]
["100166",{"$f":"Products!D43","v":"Loxone Music Server 8 Zone"},{"$f":"Products!E43","v":1849},{"$f":"Products!F43","v":1849}]
["100167",{"$f":"Products!D44","v":"Loxone Music Server 12 Zone"},{"$f":"Products!E44","v":2099},{"$f":"Products!F44","v":2099}]
["100168",{"$f":"Products!D45","v":"Loxone Music Server 16 Zone"},{"$f":"Products!E45","v":2649},{"$f":"Products!F45","v":2649}]
["100169",{"$f":"Products!D46","v":"Loxone Music Server 20 Zone"},{"$f":"Products!E46","v":2999},{"$f":"Products!F46","v":2999}]
["200097",{"$f":"Products!D97","v":"Loxone Speaker"},{"$f":"Products!E97","v":117},{"$f":"Products!F97","v":117}]
["200110",{"$f":"Products!D104","v":"Loxone 12 Channel Amplifier"},{"$f":"Products!E104","v":999},{"$f":"Products!F104","v":999}]
["200150",{"$f":"Products!D112","v":"Loxone Speaker Back Box"},{"$f":"Products!E112","v":58},{"$f":"Products!F112","v":58}]
["200153",{"$f":"Products!D114","v":"Loxone Wall Speaker"},{"$f":"Products!E114","v":149},{"$f":"Products!F114","v":149}]
[200202.0,{"$f":"Products!D139","v":"Loxone Speaker Back Box For Suspended Ceilings"},{"$f":"Products!E139","v":39},{"$f":"Products!F139","v":39}]
[100205.0,{"$f":"Products!D143","v":"Loxone Music Server Upgrade"},{"$f":"Products!E143","v":140.09},{"$f":"Products!F143","v":140.09}]

{"sheet":"Heating","index":2,"n_rows":11,"n_cols":5,"rows_kept":11,"cut":false,"hidden":true,"merged":[]}
["Artikelnummer+","Bezeichnung","Preis excl.","Preis Inkl.","Notiz"]
["100163",null,{"$f":"Products!E41","v":86},{"$f":"Products!F41","v":86}]
["200003",null,{"$f":"Products!E57","v":59},{"$f":"Products!F57","v":59}]
[200004.0,{"$f":"Products!D41","v":"Valve Actuator Air"},{"$f":"Products!E58","v":0},{"$f":"Products!F58","v":0}]
[200005.0,{"$f":"Products!D57","v":"Outside Temperature Sensor 0-10V"},{"$f":"Products!E59","v":0},{"$f":"Products!F59","v":0}]
[200006.0,{"$f":"Products!D60","v":"Indoor Temperature Sensor 0-10V"},{"$f":"Products!E60","v":59},{"$f":"Products!F60","v":59}]
[200010.0,{"$f":"Products!D62","v":"Indoor Temperature & Humidity Sensor 0-10V"},{"$f":"Products!E62","v":119},{"$f":"Products!F62","v":119}]
[200017.0,{"$f":"Products!D65","v":"Indoor Temperature, Humidty & CO2 Sensor 0-10V"},{"$f":"Products!E65","v":314},{"$f":"Products!F65","v":314}]
[200077.0,{"$f":"Products!D87","v":"Temperature Probe 1-Wire"},{"$f":"Products!E87","v":15.5},{"$f":"Products!F87","v":15.5}]
[200109.0,{"$f":"VLOOKUP(Main!C2,Translating_general!A101:P118,9,FALSE)","v":"1-Wire Temperature Sensor"},{"$f":"Products!E103","v":53.9},{"$f":"Products!F103","v":53.9}]
[null,{"$f":"Products!D154","v":"Valve Actuator Tree"}]

{"sheet":"Entry","index":3,"n_rows":9,"n_cols":5,"rows_kept":9,"cut":false,"hidden":true,"merged":[]}
["Artikelnummer+","Bezeichnung","Preis excl.","Preis Inkl.","Notiz"]
["200063",{"$f":"Products!D83","v":"iButton Reader 1-Wire"},{"$f":"Products!E83","v":13},{"$f":"Products!F83","v":13}]
["200064",{"$f":"Products!D84","v":"iButton Electronic Key Fob"},{"$f":"Products!E84","v":5},{"$f":"Products!F84","v":5}]
["200070",{"$f":"Products!D86","v":"not available in this country"},{"$f":"Products!E86","v":0},{"$f":"Products!F86","v":0}]
["200093",{"$f":"Products!D94","v":"Loxone Intercom"},{"$f":"Products!E94","v":1149},{"$f":"Products!F94","v":1149}]
["200094",{"$f":"Products!D95","v":"Flush-mounted box for the Loxone intercom"},{"$f":"Products!E95","v":70},{"$f":"Products!F95","v":70}]
["200095",{"$f":"Products!D96","v":"Surface Box for Loxone Intercom"},{"$f":"Products!E96","v":130},{"$f":"Products!F96","v":130}]
["200191",{"$f":"Products!D137","v":"iButton Reader 1-Wire Outdoor"},{"$f":"Products!E137","v":38},{"$f":"Products!F137","v":38}]
[200273.0,{"$f":"Products!D144","v":"Loxone Intercom XL"},{"$f":"Products!E144","v":1269},{"$f":"Products!F144","v":1269}]

{"sheet":"Main","index":4,"n_rows":107,"n_cols":49,"rows_kept":107,"cut":false,"hidden":false,"merged":[[4,0,14,0],[1,4,1,40],[1,2,1,3],[91,0,100,0],[102,0,106,0],[63,0,71,0],[58,0,61,0],[80,0,89,0],[75,0,78,0],[20,0,24,0],[26,0,31,0],[16,0,18,0],[40,0,49,0],[33,0,38,0],[51,0,56,0]]}
[]
[null,"Language / Country","EN_US",null,{"$f":"VLOOKUP(C2,Translating_general!A5:P22,3,FALSE)","v":"Rooms"}]
["Version 2.8.6'",{"$f":"VLOOKUP(C2,Translating_general!A5:P22,3,FALSE)","v":"Rooms"},{"$f":"VLOOKUP(C2,Translating_general!A5:B17,2,FALSE)","v":"Quantity"}]
[null,{"$f":"VLOOKUP(C2,Translating_general!A5:Q22,17,FALSE)","v":"Drop Down Selection"}]
[{"$f":"VLOOKUP(C2,Translating_general!A5:P22,4,FALSE)","v":"Light"},{"$f":"Light!B18","v":"Light Circut (switched )"},{"$f":"SUM(D5:AI5)","v":0},null,null,null,null,null,null,null,null,null,null,null,null,null,null,null,null,null,null,null,null,null,null,null,null,null,null,null,null,null,null,null,null,null,null,null,null,null,null,null,null,null,null,null,null,null,"There are drop down menues!"]
[null,{"$f":"Light!B3","v":"Dimmer Channel (110V)"},0]
[null,{"$f":"Light!B12","v":"RGBW LED Strip 5m IP20"},0]
[null,{"$f":"Light!B20","v":"LED Spot Warm White"},0]
[null,null,0]
[null,null,0]
[null,null,0]
[null,null,0]
[null,null,0]
[null,null,0]
[null,null,0]
[]
[{"$f":"VLOOKUP(C2,Translating_general!A5:P22,5,FALSE)","v":"Shading"},{"$f":"Shading!B4","v":"not available in this country"},{"$f":"SUM(D17:AI17)","v":0}]
[null,{"$f":"Shading!B3","v":"Shading (Blinds, Curtains, …)"},0]
[null,null,0]
[]
[{"$f":"VLOOKUP(C2,Translating_general!A5:P22,6,FALSE)","v":"Heating"},{"$f":"Heating!B11","v":"Valve Actuator Tree"},{"$f":"SUM(D21:AI21)","v":0}]
[null,{"$f":"Heating!B4","v":"Valve Actuator Air"},0]
[null,{"$f":"Heating!B10","v":"1-Wire Temperature Sensor"},0]
[null,null,0]
[null,null,0]
[]
[{"$f":"VLOOKUP(C2,Translating_general!A5:P22,7,FALSE)","v":"Sensor"},{"$f":"Sensors!B22","v":"Motion Sensor Tree White"},{"$f":"SUM(D27:AI27)","v":0}]
[null,{"$f":"Sensors!B25","v":"Door & Window Contact Air White"},0]
[null,{"$f":"Sensors!B26","v":"Digital IN (Reserve)"},0]
[null,{"$f":"Sensors!B27","v":"Analog IN (Reserve)"},0]
[null,{"$f":"Sensors!B9","v":"Windsensor 24V"},0]
[null,{"$f":"Wireless!B31","v":"Window Handle Air"},0]
[]
[{"$f":"VLOOKUP(C2,Translating_general!A5:S22,19,FALSE)","v":"Tree"},{"$f":"Tree!B5","v":"Touch Tree White"},{"$f":"SUM(D34:AO34)","v":0}]
[null,{"$f":"Tree!B8","v":"Valve Actuator Tree"},0]
[null,{"$f":"Tree!B9","v":"Motion Sensor Tree Black"},0]
[null,null,0]
[null,null,0]
[null,null,0]
[]
[{"$f":"VLOOKUP(C2,Translating_general!A5:P22,8,FALSE)","v":"Air"},{"$f":"Wireless!B26","v":"Touch pure Air White"},{"$f":"SUM(D41:AI41)","v":0}]
[null,{"$f":"Wireless!B12","v":"Loxone Touch Air White"},0]
[null,{"$f":"Wireless!B8","v":"Smoke Detector Air"},0]
[null,{"$f":"Wireless!B6","v":"Remote Air"},0]
[null,{"$f":"Wireless!B25","v":"Door & Window Contact Air White"},0]
[null,{"$f":"Wireless!B28","v":"not available in this country"},0]
[null,{"$f":"Wireless!B31","v":"Window Handle Air"},0]
[null,null,0]
[null,null,0]
[null,null,0]
[]
[{"$f":"VLOOKUP(C2,Translating_general!A5:P22,9,FALSE)","v":"Push-Buttons"},{"$f":"Switch!B2","v":"Retractive Wattstoper 1 Push button (reserve 1 DI)"},{"$f":"SUM(D52:AI52)","v":0}]
[null,{"$f":"Switch!B5","v":"Retractive  Wattstoper 5 Push buttons (reserve 5 DI)"},0]
[null,null,0]
[null,null,0]
[null,null,0]
[null,null,0]
[]
[{"$f":"VLOOKUP(C2,Translating_general!A5:P22,10,FALSE)","v":"Access"},{"$f":"Entry!B9","v":"Loxone Intercom XL"},{"$f":"SUM(D59:AI59)","v":0}]
[null,{"$f":"Entry!B8","v":"iButton Reader 1-Wire Outdoor"},0]
[null,{"$f":"Entry!B3","v":"iButton Electronic Key Fob"},0]
[null,null,0]
[]
[{"$f":"VLOOKUP(C2,Translating_general!A5:P22,11,FALSE)","v":"Music"},{"$f":"Music!B2","v":"Music Server Zone"},{"$f":"SUM(D64:AI64)","v":0}]
[null,{"$f":"Music!B8","v":"Loxone Speaker"},0]
[null,{"$f":"Music!B9","v":"Loxone 12 Channel Amplifier"},0]
[null,{"$f":"Music!B10","v":"Loxone Speaker Back Box"},0]
[null,{"$f":"Music!B11","v":"Loxone Wall Speaker"},0]
[null,null,0]
[null,null,0]
[null,null,0]
[null,null,0]
[null,null,0.0]
[]
[]
[{"$f":"VLOOKUP(C2,Translating_general!A5:P22,12,FALSE)","v":"Miniserver&Extension"},{"$f":"'Ms&Extensions'!B6","v":"RS 232 Extension"},{"$f":"SUM(D76:AI76)","v":0}]
[null,{"$f":"'Ms&Extensions'!B4","v":"RS485 Extension"},0]
[null,null,0]
[null,null,0]
[]
[{"$f":"VLOOKUP(C2,Translating_general!A5:P22,13,FALSE)","v":"Cabinet"},{"$f":"Distributors!B18","v":"Loxone CAT7 Cable (250m)"},{"$f":"SUM(D81:AI81)","v":0}]
[null,{"$f":"Distributors!B7","v":"Push In Terminal Block 3+Earth (50 pcs)"},0]
[null,null,0]
[null,null,0]
[null,null,0]
[null,null,0]
[null,null,0]
[null,null,0]
[null,null,0]
[null,null,0]
[]
[{"$f":"VLOOKUP(C2,Translating_general!A5:P22,14,FALSE)","v":"Other"},{"$f":"Other!B35","v":"not available in this country"},{"$f":"SUM(D92:AI92)","v":0}]
[null,{"$f":"Other!B37","v":"NFC Smart Tags"},0]
[null,null,0]
[null,null,0]
[null,null,0]
[null,null,0]
[null,null,0]
[null,null,0]
[null,null,0]
[null,null,0]
[]
[{"$f":"VLOOKUP(C2,Translating_general!A5:P22,15,FALSE)","v":"Fans&Partner"},{"$f":"Other!B11","v":"Loxone Brochure (25 pcs)"},{"$f":"SUM(D103:AI103)","v":0}]
[null,{"$f":"Other!B2","v":"Rollup Banner English"},0]
[null,{"$f":"Other!B3","v":"not available in this country"},0]
[null,null,0]
[null,null,0]

{"sheet":"Sensors","index":5,"n_rows":28,"n_cols":5,"rows_kept":28,"cut":false,"hidden":true,"merged":[]}
["Artikelnummer+","Bezeichnung","Preis excl.","Preis Inkl.","Notiz"]
[200003.0,{"$f":"Products!D57","v":"Outside Temperature Sensor 0-10V"},{"$f":"Products!E57","v":59},{"$f":"Products!F57","v":59}]
[200006.0,{"$f":"Products!D60","v":"Indoor Temperature Sensor 0-10V"},{"$f":"Products!E60","v":59},{"$f":"Products!F60","v":59}]
[200010.0,{"$f":"Products!D62","v":"Indoor Temperature & Humidity Sensor 0-10V"},{"$f":"Products!E62","v":119},{"$f":"Products!F62","v":119}]
["200017",{"$f":"Products!D65","v":"Indoor Temperature, Humidty & CO2 Sensor 0-10V"},{"$f":"Products!E65","v":314},{"$f":"Products!F65","v":314}]
["200018",{"$f":"Products!D66","v":"Rain Sensor (24V)"},{"$f":"Products!E66","v":79},{"$f":"Products!F66","v":79}]
["200031",{"$f":"Products!D67","v":"Outdoor Temperature & Humidy Sensor 0-10V"},{"$f":"Products!E67","v":159},{"$f":"Products!F67","v":159}]
["200032",{"$f":"Products!D68","v":"Brightness Sensor 0-10V"},{"$f":"Products!E68","v":109},{"$f":"Products!F68","v":109}]
["200033",{"$f":"VLOOKUP(Main!C2,Translating_general!A101:P118,10,FALSE)","v":"Windsensor 24V"},{"$f":"Products!E69","v":99},{"$f":"Products!F69","v":99}]
["200034",{"$f":"Products!D70","v":"Wind Sensor Mount"},{"$f":"Products!E70","v":75},{"$f":"Products!F70","v":75}]
["200054",{"$f":"Products!D79","v":"Ultrasonic Sensor 0-10V"},{"$f":"Products!E79","v":289},{"$f":"Products!F79","v":289}]
[200077.0,{"$f":"Products!D87","v":"Temperature Probe 1-Wire"},{"$f":"Products!E87","v":15.5},{"$f":"Products!F87","v":15.5}]
["200101",{"$f":"Products!D101","v":"Water Sensor"},{"$f":"Products!E101","v":23},{"$f":"Products!F101","v":23}]
[200109.0,{"$f":"Products!D103","v":"Temperature Sensor Set 1-Wire"},{"$f":"Products!E103","v":53.9},{"$f":"Products!F103","v":53.9}]
["200112",{"$f":"Products!D105","v":"Outside Motion Sensor (24V)"},{"$f":"Products!E105","v":135},{"$f":"Products!F105","v":135}]
[null,{"$f":"VLOOKUP(Main!C2,Translating_general!A101:P118,11,FALSE)","v":"Window Contact (integrated - only reserve DI)"}]
["200113",{"$f":"Products!D106","v":"Window & Door Contact"},{"$f":"Products!E106","v":13.5},{"$f":"Products!F106","v":13.5}]
["200136",{"$f":"Products!D109","v":"Temperature & Humidity Sensor For Saunas"},{"$f":"Products!E109","v":205},{"$f":"Products!F109","v":205}]
["200154",{"$f":"Products!D115","v":"Pressure Sensor 0-10V"},{"$f":"Products!E115","v":115},{"$f":"Products!F115","v":115}]
["200155",{"$f":"Products!D116","v":"Glass Break Sensor 24V"},{"$f":"Products!E116","v":34},{"$f":"Products!F116","v":34}]
[null,{"$f":"Products!D158","v":"Motion Sensor Tree Black"}]
[null,{"$f":"Products!D153","v":"Motion Sensor Tree White"}]
[null,{"$f":"Products!D155","v":"Water Sensor Air"}]
[null,{"$f":"Products!D156","v":"Door & Window Contact Air Black"}]
[null,{"$f":"Products!D157","v":"Door & Window Contact Air White"}]
[null,{"$f":"HLOOKUP(Main!$C$2,Translating_products!$DI$4:$DY$216,Translating_products!CM187, FALSE)","v":"Digital IN (Reserve)"}]
[null,{"$f":"HLOOKUP(Main!$C$2,Translating_products!$DI$4:$DY$216,Translating_products!CM188, FALSE)","v":"Analog IN (Reserve)"}]
[null,{"$f":"HLOOKUP(Main!$C$2,Translating_products!$DI$4:$DY$216,Translating_products!CM189, FALSE)","v":"Window Handle Air"}]

{"sheet":"Distributors","index":6,"n_rows":21,"n_cols":5,"rows_kept":21,"cut":false,"hidden":true,"merged":[]}
["Artikelnummer+","Bezeichnung","Preis excl.","Preis Inkl.","Notiz"]
["200168",{"$f":"Products!D120","v":"Push In Terminal Block 8x4 Interconnected (20 pcs)"},{"$f":"Products!E120","v":265},{"$f":"Products!F120","v":265}]
["200169",{"$f":"Products!D121","v":"Push In Terminal Block 8x4 Seperated (20pcs)"},{"$f":"Products!E121","v":249},{"$f":"Products!F121","v":249}]
["200170",{"$f":"VLOOKUP(Main!$C$2,Translating_general!$A$101:$AZ$118,21,FALSE)","v":"Partition for 8x4 Terminals (10pcs)"},{"$f":"Products!E122","v":14},{"$f":"Products!F122","v":14}]
["200171",{"$f":"VLOOKUP(Main!$C$2,Translating_general!$A$101:$AZ$118,22,FALSE)","v":"Label Holder 8 Levels (20 pcs)"},{"$f":"Products!E123","v":34},{"$f":"Products!F123","v":34}]
["200172",{"$f":"VLOOKUP(Main!$C$2,Translating_general!$A$101:$AZ$118,23,FALSE)","v":"End Plate for 8x4 Terminals (10 pcs)"},{"$f":"Products!E124","v":7},{"$f":"Products!F124","v":7}]
["200173",{"$f":"VLOOKUP(Main!$C$2,Translating_general!$A$101:$AZ$118,24,FALSE)","v":"Push In Terminal Block 3+Earth (50 pcs)"},{"$f":"Products!E125","v":259},{"$f":"Products!F125","v":259}]
["200174",{"$f":"VLOOKUP(Main!$C$2,Translating_general!$A$101:$AZ$118,25,FALSE)","v":"End Plate for 3+Earth Terminals (20 pcs)"},{"$f":"Products!E126","v":14},{"$f":"Products!F126","v":14}]
["200175",{"$f":"VLOOKUP(Main!$C$2,Translating_general!$A$101:$AZ$118,26,FALSE)","v":"Push In Terminal Block Twin+Earth (50 pcs)"},{"$f":"Products!E127","v":141.5},{"$f":"Products!F127","v":141.5}]
["200176",{"$f":"VLOOKUP(Main!$C$2,Translating_general!$A$101:$AZ$118,27,FALSE)","v":"End Bracket (20 pcs)"},{"$f":"Products!E128","v":10},{"$f":"Products!F128","v":10}]
["200177",{"$f":"VLOOKUP(Main!$C$2,Translating_general!$A$101:$AZ$118,28,FALSE)","v":"End Plate for Twin+Earth Terminals (20 pcs)"},{"$f":"Products!E129","v":10},{"$f":"Products!F129","v":10}]
["200178",{"$f":"VLOOKUP(Main!$C$2,Translating_general!$A$101:$AZ$118,29,FALSE)","v":"Push in Fused Terminal Block (25 pcs)"},{"$f":"Products!E130","v":159},{"$f":"Products!F130","v":159}]
["200179",{"$f":"VLOOKUP(Main!$C$2,Translating_general!$A$101:$AZ$118,30,FALSE)","v":"End Plate For Fused Terminals (50 pcs)"},{"$f":"Products!E131","v":22},{"$f":"Products!F131","v":22}]
["200180",{"$f":"VLOOKUP(Main!$C$2,Translating_general!$A$101:$AZ$118,31,FALSE)","v":"Cross Connector For Fused Terminals (10 pcs)"},{"$f":"Products!E132","v":79},{"$f":"Products!F132","v":79}]
["200181",{"$f":"VLOOKUP(Main!$C$2,Translating_general!$A$101:$AZ$118,32,FALSE)","v":"Blade Fuse 2A (100 pcs)"},{"$f":"Products!E133","v":13},{"$f":"Products!F133","v":13}]
["200183",{"$f":"VLOOKUP(Main!$C$2,Translating_general!$A$101:$AZ$118,33,FALSE)","v":"Blade Fuse 5A (100 pcs)"},{"$f":"Products!E134","v":13},{"$f":"Products!F134","v":13}]
["200184",{"$f":"VLOOKUP(Main!$C$2,Translating_general!$A$101:$AZ$118,34,FALSE)","v":"Blade Fuse 10A (100 pcs)"},{"$f":"Products!E135","v":13},{"$f":"Products!F135","v":13}]
["200129",{"$f":"VLOOKUP(Main!$C$2,Translating_general!$A$101:$AZ$118,35,FALSE)","v":"Loxone CAT7 Cable (250m)"},{"$f":"Products!E107","v":265},{"$f":"Products!F107","v":265}]
["100150",{"$f":"Products!D35","v":"Loxone Tool Kit by Weidmüller"},{"$f":"Products!E35","v":339},{"$f":"Products!F35","v":339}]
["200204",{"$f":"Products!D159","v":"Cross Connector for Mains Terminals (20 pcs)"},{"$f":"Products!E159","v":96},{"$f":"Products!F159","v":96}]
[null,{"$f":"Products!D77","v":"Coupling Relay"}]

{"sheet":"Tree","index":7,"n_rows":15,"n_cols":2,"rows_kept":15,"cut":false,"hidden":true,"merged":[]}
[]
[]
[null,"Bezeichnung"]
[null,{"$f":"Products!D150","v":"Tree Extension"}]
[null,{"$f":"Products!D151","v":"Touch Tree White"}]
[null,{"$f":"Products!D152","v":"Touch Tree Black"}]
[null,{"$f":"Products!D153","v":"Motion Sensor Tree White"}]
[null,{"$f":"Products!D154","v":"Valve Actuator Tree"}]
[null,{"$f":"Products!D158","v":"Motion Sensor Tree Black"}]
[null,{"$f":"Products!D164","v":"Touch pure Tree White"}]
[null,{"$f":"Products!D175","v":"Nano DI Tree"}]
[null,{"$f":"Products!D178","v":"Touch pure Tree Black"}]
[null,{"$f":"Products!D182","v":"LED Ceiling Spot Tree RGBW"}]
[null,{"$f":"Products!D184","v":"LED Spot Tree WW"}]
[null,{"$f":"Products!D186","v":"RGBW 24V Dimmer Tree"}]

{"sheet":"Wireless","index":8,"n_rows":40,"n_cols":5,"rows_kept":40,"cut":false,"hidden":true,"merged":[]}
["Artikelnummer+","Bezeichnung","Preis excl.","Preis Inkl.","Notiz"]
["100114",{"$f":"Products!D24","v":"Air Base Extension"},{"$f":"Products!E24","v":113},{"$f":"Products!F24","v":113}]
["100115",{"$f":"Products!D25","v":"not available in this country"},{"$f":"Products!E25","v":0},{"$f":"Products!F25","v":0}]
["100116",{"$f":"Products!D26","v":"Multi Extension Air"},{"$f":"Products!E26","v":539},{"$f":"Products!F26","v":539}]
["100139",{"$f":"Products!D30","v":"Miniserver Go"},{"$f":"Products!E30","v":349},{"$f":"Products!F30","v":349}]
["100140",{"$f":"Products!D31","v":"Remote Air"},{"$f":"Products!E31","v":55.5},{"$f":"Products!F31","v":55.5}]
["100141",{"$f":"Products!D32","v":"IR Control Air"},{"$f":"Products!E32","v":124.9},{"$f":"Products!F32","v":124.9}]
["100142",{"$f":"Products!D33","v":"Smoke Detector Air"},{"$f":"Products!E33","v":99},{"$f":"Products!F33","v":99}]
["100149",{"$f":"Products!D34","v":"Temperature & Humidity Sesnor Air"},{"$f":"Products!E34","v":79},{"$f":"Products!F34","v":79}]
["100151",{"$f":"Products!D36","v":"not available in this country"},{"$f":"Products!E36","v":0},{"$f":"Products!F36","v":0}]
["100154",{"$f":"Products!D38","v":"Loxone Touch for Nano White"},{"$f":"Products!E38","v":49},{"$f":"Products!F38","v":49}]
["100155",{"$f":"Products!D39","v":"Loxone Touch Air White"},{"$f":"Products!E39","v":124},{"$f":"Products!F39","v":124}]
["100180",{"$f":"Products!D50","v":"Loxone Touch Air Anthracite"},{"$f":"Products!E50","v":124},{"$f":"Products!F50","v":124}]
["100181",{"$f":"Products!D51","v":"Loxone Touch for Nano Anthracite"},{"$f":"Products!E51","v":49},{"$f":"Products!F51","v":49}]
["100182",{"$f":"Products!D52","v":"not available in this country"},{"$f":"Products!E52","v":0},{"$f":"Products!F52","v":0}]
["100183",{"$f":"Products!D53","v":"not available in this country"},{"$f":"Products!E53","v":0},{"$f":"Products!F53","v":0}]
["100184",{"$f":"Products!D54","v":"not available in this country"},{"$f":"Products!E54","v":0},{"$f":"Products!F54","v":0}]
["100163",{"$f":"Products!D41","v":"Valve Actuator Air"},{"$f":"Products!E41","v":86},{"$f":"Products!F41","v":86}]
["200048",{"$f":"Products!D76","v":"SMA Antenna 868 MHz"},{"$f":"Products!E76","v":19},{"$f":"Products!F76","v":19}]
["200151",{"$f":"Products!D113","v":"SMA Antenna 4dBi 868 MHz"},{"$f":"Products!E113","v":29.9},{"$f":"Products!F113","v":29.9}]
["100190",{"$f":"Products!D145","v":"Motion Sensor Air"},{"$f":"Products!E145","v":95},{"$f":"Products!F145","v":95}]
["100153",{"$f":"Products!D37","v":"Nano IO Air"},{"$f":"Products!E37","v":119},{"$f":"Products!F37","v":119}]
["wird nicht verwendet",{"$f":"Products!D155","v":"Water Sensor Air"},"wird nicht verwendet","wird nicht verwendet"]
[null,{"$f":"Products!D156","v":"Door & Window Contact Air Black"}]
[null,{"$f":"Products!D157","v":"Door & Window Contact Air White"}]
[null,{"$f":"Products!D162","v":"Touch pure Air White"}]
[null,{"$f":"Products!D163","v":"Touch pure for Nano White"}]
[null,{"$f":"Products!D166","v":"not available in this country"}]
[null,{"$f":"Products!D179","v":"Touch pure Air Black"}]
[null,{"$f":"Products!D177","v":"Touch pure Nano Black"}]
[null,{"$f":"HLOOKUP(Main!$C$2,Translating_products!$DI$4:$DY$216,Translating_products!CM189, FALSE)","v":"Window Handle Air"}]
[]
[]
[]
[]
[]
["200059",{"$f":"Products!D81","v":"not available in this country"},{"$f":"Products!E81","v":0},{"$f":"Products!F81","v":0}]
["200067",{"$f":"Products!D85","v":"not available in this country"},{"$f":"Products!E85","v":0},{"$f":"Products!F85","v":0}]
["200135",{"$f":"Products!D108","v":"not available in this country"},{"$f":"Products!E108","v":0},{"$f":"Products!F108","v":0}]
["200137",{"$f":"Products!D110","v":"not available in this country"},{"$f":"Products!E110","v":0},{"$f":"Products!F110","v":0}]

{"sheet":"Other","index":9,"n_rows":53,"n_cols":5,"rows_kept":53,"cut":false,"hidden":true,"merged":[]}
["Artikelnummer+","Bezeichnung","Preis excl.","Preis Inkl.","Kategorien_Sonstiges"]
["100004",{"$f":"Products!D9","v":"Rollup Banner English"},{"$f":"Products!E9","v":119},{"$f":"Products!F9","v":119},"Fans&Partner"]
["100170",{"$f":"Products!D47","v":"not available in this country"},{"$f":"Products!E47","v":0},{"$f":"Products!F47","v":0},"Fans&Partner"]
["200050",{"$f":"Products!D78","v":"Loxone Sticker"},{"$f":"Products!E78","v":5},{"$f":"Products!F78","v":5},"Fans&Partner"]
["200086",{"$f":"Products!D88","v":"Fanshirt S"},{"$f":"Products!E88","v":19},{"$f":"Products!F88","v":19},"Fans&Partner"]
["200087",{"$f":"Products!D89","v":"Fanshirt M"},{"$f":"Products!E89","v":19},{"$f":"Products!F89","v":19},"Fans&Partner"]
["200088",{"$f":"Products!D90","v":"Fanshirt L"},{"$f":"Products!E90","v":19},{"$f":"Products!F90","v":19},"Fans&Partner"]
["200089",{"$f":"Products!D91","v":"Fanshirt XL"},{"$f":"Products!E91","v":19},{"$f":"Products!F91","v":19},"Fans&Partner"]
["200090",{"$f":"Products!D92","v":"Fanshirt XXL"},{"$f":"Products!E92","v":19},{"$f":"Products!F92","v":19},"Fans&Partner"]
["200158",{"$f":"Products!D119","v":"not available in this country"},{"$f":"Products!E119","v":0},{"$f":"Products!F119","v":0},"Fans&Partner"]
["200186",{"$f":"Products!D136","v":"Loxone Brochure (25 pcs)"},{"$f":"Products!E136","v":5},{"$f":"Products!F136","v":5},"Fans&Partner"]
["100008",{"$f":"Products!D10","v":"Micro SD Card with firmware"},{"$f":"Products!E10","v":14},{"$f":"Products!F10","v":14},"Zubehör"]
["100023",{"$f":"Products!D16","v":"No longer sold"},{"$f":"Products!E16","v":0},{"$f":"Products!F16","v":0},"Zubehör"]
["100025",{"$f":"Products!D17","v":"Weather Service 1 Year"},{"$f":"Products!E17","v":69},{"$f":"Products!F17","v":69},"Zubehör"]
["100026",{"$f":"Products!D18","v":"Weather Service 10 Year"},{"$f":"Products!E18","v":325},{"$f":"Products!F18","v":325},"Zubehör"]
["100027",{"$f":"Products!D19","v":"Caller Service 1 Year"},{"$f":"Products!E19","v":69},{"$f":"Products!F19","v":69},"Zubehör"]
["100028",{"$f":"Products!D20","v":"Caller Service 10 Years"},{"$f":"Products!E20","v":325},{"$f":"Products!F20","v":325},"Zubehör"]
["100035",{"$f":"Products!D22","v":"IR Set"},{"$f":"Products!E22","v":229},{"$f":"Products!F22","v":229},"Zubehör"]
["100178",{"$f":"Products!D48","v":"AquaStar Air 1.5\""},{"$f":"Products!E48","v":1549},{"$f":"Products!F48","v":1549},"Zubehör"]
["100179",{"$f":"Products!D49","v":"AquaStar Air 2\""},{"$f":"Products!E49","v":1649},{"$f":"Products!F49","v":1649},"Zubehör"]
["200001",{"$f":"Products!D55","v":"24V Power Supply (1.3A)"},{"$f":"Products!E55","v":49},{"$f":"Products!F55","v":49},"Zubehör"]
["200002",{"$f":"Products!D56","v":"24V Power Supply (4.2A)"},{"$f":"Products!E56","v":76},{"$f":"Products!F56","v":76},"Zubehör"]
["200007",{"$f":"Products!D61","v":"not available in this country"},{"$f":"Products!E61","v":0},{"$f":"Products!F61","v":0},"Zubehör"]
["200012",{"$f":"Products!D63","v":"Valve Adaptor VA80"},{"$f":"Products!E63","v":2},{"$f":"Products!F63","v":2},"Zubehör"]
["200013",{"$f":"Products!D64","v":"not available in this country"},{"$f":"Products!E64","v":0},{"$f":"Products!F64","v":0},"Zubehör"]
["200035",{"$f":"Products!D71","v":"24V Power Supply (10A)"},{"$f":"Products!E71","v":179},{"$f":"Products!F71","v":179},"Zubehör"]
["200040",{"$f":"Products!D72","v":"Surface Mount Box - IP20"},{"$f":"Products!E72","v":10},{"$f":"Products!F72","v":10},"Zubehör"]
["200049",{"$f":"Products!D77","v":"Coupling Relay"},{"$f":"Products!E77","v":23},{"$f":"Products!F77","v":23},"Zubehör"]
["200107",{"$f":"Products!D102","v":"not available in this country"},{"$f":"Products!E102","v":0},{"$f":"Products!F102","v":0},"Zubehör"]
["200143",{"$f":"Products!D111","v":"24V Power Supply (0.4A)"},{"$f":"Products!E111","v":36},{"$f":"Products!F111","v":36},"Zubehör"]
["200156",{"$f":"Products!D117","v":"not available in this country"},{"$f":"Products!E117","v":0},{"$f":"Products!F117","v":0},"Zubehör"]
["200157",{"$f":"Products!D118","v":"not available in this country"},{"$f":"Products!E118","v":0},{"$f":"Products!F118","v":0},"Zubehör"]
[null,{"$f":"VLOOKUP(Main!C2,Translating_general!A101:P118,12,FALSE)","v":"Other Load (5A)"},null,null,"Zubehör"]
[null,{"$f":"VLOOKUP(Main!C2,Translating_general!A101:P118,13,FALSE)","v":"Other Load (5-16A)"},null,null,"Zubehör"]
["200207",{"$f":"Products!D138","v":"not available in this country"},{"$f":"Products!E138","v":0},{"$f":"Products!F138","v":0},"Zubehör"]
["200161",{"$f":"Products!D142","v":"Power Adapter 24V 6.25A"},{"$f":"Products!E142","v":84.9},{"$f":"Products!F142","v":84.9},"Zubehör"]
["200281",{"$f":"Products!D146","v":"NFC Smart Tags"},{"$f":"Products!E146","v":26},{"$f":"Products!F146","v":26},"Zubehör"]
["200294",{"$f":"Products!D149","v":"not available in this country"},{"$f":"Products!E149","v":0},{"$f":"Products!F149","v":0},"Zubehör"]
[null,{"$f":"Products!D161","v":"24V LED Power Supply (2.5A)"},{"$f":"Products!E161","v":35},{"$f":"Products!F161","v":35},"Zubehör"]
[null,{"$f":"Products!D167","v":"Panel wire (328ft) blue/white"}]
[null,{"$f":"Products!D168","v":"Panel wire (328ft) orange/white"}]
[null,{"$f":"Products!D169","v":"Panel wire (328ft) green/white"}]
[null,{"$f":"Products!D170","v":"not available in this country"}]
[null,{"$f":"Products!D171","v":"not available in this country"}]
[null,{"$f":"Products!D172","v":"not available in this country"}]
[null,{"$f":"Products!D173","v":"not available in this country"}]
[null,{"$f":"Products!D174","v":"not available in this country"}]
[null,{"$f":"Products!D176","v":"not available in this country"}]
[]
["100011",{"$f":"Products!D11","v":"RS485 Extension"},{"$f":"Products!E11","v":199},{"$f":"Products!F11","v":199},"Zubehör"]
["100013",{"$f":"Products!D13","v":"RS 232 Extension"},{"$f":"Products!E13","v":199},{"$f":"Products!F13","v":199},"Zubehör"]
["100015",{"$f":"Products!D15","v":"not available in this country"},{"$f":"Products!E15","v":0},{"$f":"Products!F15","v":0},"Zubehör"]
["100124",{"$f":"Products!D28","v":"Modbus Extension"},{"$f":"Products!E28","v":255},{"$f":"Products!F28","v":255},"Zubehör"]

{"sheet":"Shading","index":10,"n_rows":6,"n_cols":6,"rows_kept":6,"cut":false,"hidden":true,"merged":[]}
["Artikelnummer+","Bezeichnung","Preis excl.","Preis Inkl.","Notiz"]
[100153.0,{"$f":"Products!D37","v":"Nano IO Air"},{"$f":"Products!E37","v":119},{"$f":"Products!F37","v":119},null,"Rollo per Kabel zu NANO IO und Nano zu AirBase per Funk"]
[null,{"$f":"VLOOKUP(Main!C2,Translating_general!A101:P118,14,FALSE)","v":"Shading (Blinds, Curtains, …)"},null,null,null,"pro Rollo/Markise/Jalousie/Raffstore 1 Nano"]
["100182",{"$f":"Products!D52","v":"not available in this country"},{"$f":"Products!E52","v":0},{"$f":"Products!F52","v":0},null,"1 Nano belegt 1 Kanal auf AirBase"]
["100183",{"$f":"Products!D53","v":"not available in this country"},{"$f":"Products!E53","v":0},{"$f":"Products!F53","v":0}]
["100184",{"$f":"Products!D54","v":"not available in this country"},{"$f":"Products!E54","v":0},{"$f":"Products!F54","v":0}]

{"sheet":"Switch","index":11,"n_rows":18,"n_cols":7,"rows_kept":18,"cut":false,"hidden":true,"merged":[]}
["Artikelnummer+","Bezeichnung","Preis excl.","Preis Inkl.","Notiz"]
[null,{"$f":"VLOOKUP(Main!$C$2,Translating_general!$A$101:$T$118,16,FALSE)","v":"Retractive Wattstoper 1 Push button (reserve 1 DI)"},null,null,"Kabeltaster"]
[null,{"$f":"VLOOKUP(Main!$C$2,Translating_general!$A$101:$T$118,17,FALSE)","v":"Retractive  Wattstoper 2 Push buttons (reserve 2 DI)"},null,null,"Kabeltaster",null,"taster belegen nur Eingänge"]
[null,{"$f":"VLOOKUP(Main!$C$2,Translating_general!$A$101:$T$118,18,FALSE)","v":"Retractive  Wattstoper 4 Push buttons (reserve 4 DI)"},null,null,"Kabeltaster"]
[null,{"$f":"VLOOKUP(Main!$C$2,Translating_general!$A$101:$T$118,19,FALSE)","v":"Retractive  Wattstoper 5 Push buttons (reserve 5 DI)"},null,null,"Kabeltaster"]
["100154",{"$f":"Products!D38","v":"Loxone Touch for Nano White"},{"$f":"Products!E38","v":49},{"$f":"Products!F38","v":49},"Funktaster"]
["100155",{"$f":"Products!D39","v":"Loxone Touch Air White"},{"$f":"Products!E39","v":124},{"$f":"Products!F39","v":124},"Funktaster"]
[200057.0,{"$f":"Products!D80","v":"not available in this country"},{"$f":"Products!E80","v":0},{"$f":"Products!F80","v":0},"Funktaster"]
["100180",{"$f":"Products!D50","v":"Loxone Touch Air Anthracite"},{"$f":"Products!E50","v":124},{"$f":"Products!F50","v":124},"Funktaster"]
["100181",{"$f":"Products!D51","v":"Loxone Touch for Nano Anthracite"},{"$f":"Products!E51","v":49},{"$f":"Products!F51","v":49},"Funktaster"]
[null,{"$f":"Products!D151","v":"Touch Tree White"}]
[null,{"$f":"Products!D152","v":"Touch Tree Black"}]
[null,{"$f":"Products!D162","v":"Touch pure Air White"}]
[null,{"$f":"Products!D163","v":"Touch pure for Nano White"}]
[null,{"$f":"Products!D164","v":"Touch pure Tree White"}]
[null,{"$f":"Products!D177","v":"Touch pure Nano Black"}]
[null,{"$f":"Products!D178","v":"Touch pure Tree Black"}]
[null,{"$f":"Products!D179","v":"Touch pure Air Black"}]

{"sheet":"Ms&Extensions","index":12,"n_rows":18,"n_cols":5,"rows_kept":18,"cut":false,"hidden":true,"merged":[]}
["Artikelnummer+","Bezeichnung","Preis excl.","Preis Inkl.","Notiz"]
["100001",{"$f":"Products!D7","v":"Miniserver"},{"$f":"Products!E7","v":549},{"$f":"Products!F7","v":549}]
["100002",{"$f":"Products!D8","v":"Extension"},{"$f":"Products!E8","v":449},{"$f":"Products!F8","v":449}]
["100011",{"$f":"Products!D11","v":"RS485 Extension"},{"$f":"Products!E11","v":199},{"$f":"Products!F11","v":199}]
["100012",{"$f":"Products!D12","v":"DMX Extension"},{"$f":"Products!E12","v":299},{"$f":"Products!F12","v":299}]
["100013",{"$f":"Products!D13","v":"RS 232 Extension"},{"$f":"Products!E13","v":199},{"$f":"Products!F13","v":199}]
["100014",{"$f":"Products!D14","v":"1-Wire Extension"},{"$f":"Products!E14","v":199},{"$f":"Products!F14","v":199}]
["100015",{"$f":"Products!D15","v":"not available in this country"},{"$f":"Products!E15","v":0},{"$f":"Products!F15","v":0}]
[100124.0,{"$f":"Products!D28","v":"Modbus Extension"},{"$f":"Products!E28","v":255},{"$f":"Products!F28","v":255}]
["100029",{"$f":"Products!D21","v":"Dimmer Extension"},{"$f":"Products!E21","v":499},{"$f":"Products!F21","v":499}]
["100038",{"$f":"Products!D23","v":"Relay Extension"},{"$f":"Products!E23","v":539},{"$f":"Products!F23","v":539}]
["100114",{"$f":"Products!D24","v":"Air Base Extension"},{"$f":"Products!E24","v":113},{"$f":"Products!F24","v":113}]
["100116",{"$f":"Products!D26","v":"Multi Extension Air"},{"$f":"Products!E26","v":539},{"$f":"Products!F26","v":539}]
["100139",{"$f":"Products!D30","v":"Miniserver Go"},{"$f":"Products!E30","v":349},{"$f":"Products!F30","v":349}]
["100158",{"$f":"Products!D40","v":"not available in this country"},{"$f":"Products!E40","v":0},{"$f":"Products!F40","v":0}]
[null,{"$f":"Products!D150","v":"Tree Extension"}]
[null,{"$f":"Products!D160","v":"Dali Extension"}]
[null,{"$f":"Products!D165","v":"not available in this country"}]

{"sheet":"Calculation","index":13,"n_rows":512,"n_cols":15,"rows_kept":512,"cut":false,"hidden":true,"merged":[[28,1,28,2],[46,1,46,2],[119,5,119,6],[118,5,118,6],[120,5,120,6],[121,5,121,6],[122,5,122,6],[3,0,17,0],[72,3,72,4]]}
["MsGO =",false,null,"AI (Eingang)","DI (Eingang)","AO (Ausgang)","DO (Ausgang)","1-Wire Kanal","Air Base Kanal","EnOcean","Tree","DO 16A","Air Dimmer","Dimmkanäle","Dali"]
[]
[null,null,null,"AI (Eingang)","DI (Eingang)","AO (Ausgang)","DO (Ausgang)","1-Wire Kanal","Air Base Kanal","EnOcean","Tree","DO 16A","Air Dimmer","Dali Kanäle","1-wire leser"]
["Eingabe Kunde","Benötigte Eingänge|Ausgänge|Kanäle",null,{"$f":"(E141+D195)*(-1)","v":0},{"$f":"(E195+D376)*(-1)","v":0},{"$f":"F141*(-1)+G103*(-1)","v":0},{"$f":"(G141+D344+H75+E322)*(-1)","v":0},{"$f":"(H141+H195)*(-1)","v":0},{"$f":"(E103+D256+E344+F376+I195+I141+L195)*(-1)","v":0},{"$f":"(-1)*(E256+G376)","v":0},{"$f":"F277*(-1)","v":0},{"$f":"D322*(-1)+K103*(-1)","v":0},null,{"$f":"C497*(-1)","v":0},{"$f":"-1*D160","v":0}]
[null," +Miniserver (=WENN(…)+C278)",{"$f":"IF(B1=FALSE, IF(MIN(D4:O4)<0,1,0), 0)","v":0},{"$f":"$C$5*D61","v":0},0,0,0]
[null," +MsGo",{"$f":"IF(AND(B1=TRUE, I4 < 0), 1+C224+C392, C224+C392)","v":0},null,null,null,null,null,{"$f":"C6*I70","v":0}]
[null," +Dimmer Extensions",{"$f":"C388+C77","v":0},null,{"$f":"C7*E66","v":0}]
[null,"Zwischensumme 1",null,{"$f":"SUM(D4:D7)","v":0},0,0,0,0,0,0,0,0]
[null," +Relay Extension (=C286)",0.0,null,null,null,null,null,null,null,null,{"$f":"L67*C9","v":0}]
[null," +Multi Extension Air (=C288+C185)",0.0,null,{"$f":"$C$10*E69","v":0},null,null,{"$f":"$C$10*H69","v":0},null,null,null,{"$f":"$C$10*L69","v":0},{"$f":"C10","v":0}]
[null,"Zwischensumme 2",null,{"$f":"SUM(D8:D10)","v":0},0,0,0,0,0,0,0,0]
[null," +1-Wire Extension (=C283+H132)",0.0,null,null,null,null,{"$f":"C12*H64","v":0}]
[null," +EnoCean Extension (=C213+C284)",0.0,null,null,null,null,null,null,{"$f":"C13*J65","v":0}]
[null," +Dali Extension",{"$f":"C395","v":0},null,null,null,null,null,null,null,null,null,null,{"$f":"C14*N72","v":0}]
[null," +Tree Extension",0.0,null,null,null,null,null,null,null,{"$f":"C15*K71","v":0}]
[null," +AirBaseExtension (=C183+C287)",0.0,null,null,null,null,null,{"$f":"C16*I68","v":0}]
[null,"Zwischensumme 3",null,{"$f":"SUM(D11:D16)","v":0},0,0,0,0,0,0,0,0]
[null," +Extension (=C279)",0.0,{"$f":"$C$18*D62","v":0},0,0,0]
[null,"Fehlende/Überschüssige Anschlüsse_AI_auf_DI",null,{"$f":"D17","v":0},0,{"$f":"SUM(F17:F18)","v":0},0,0,0,0,0,{"$f":"L17","v":0}]
[]
[null,"Anschlüsse vor autmomatische Ergänzung von fehlenden Extensions"]
[null,"Gesamt verfügbare Anschlüsse",null,{"$f":"D5+D6+D7+D9+D10+D12+D13+D16+D18","v":0},0,0,0,0,0,0,{"$f":"K15","v":0},{"$f":"L5+L6+L7+L9+L10+L12+L13+L16+L18","v":0},{"$f":"M10","v":0},{"$f":"N14","v":0}]
[null,"Benötigte Anschlüsse",null,{"$f":"D4","v":0},0,0,0,0,0,0,0,0,null,{"$f":"N4","v":0}]
[null,"Übrigbleibende Anschlüsse",null,{"$f":"IF(D19>0,D19,0)","v":0},0,0,0,0,0,0,0,0,null,{"$f":"IF(N23>0,N23,0)","v":0}]
[null,{"$f":"Calculation!B216=Products!D35","v":true},null,{"$f":"IF(D19<0,D19,0)","v":0},0,0,0,0,0,0,0,0]
[null,"Extensions für fehlende Anschlüsse"]
[null,"Extension",{"$f":"C28","v":0},{"$f":"$C$27*D62","v":0},0,0,0]
[null,"Anzahlberechnung Extension",{"$f":"MAX(D28,F28)","v":0},{"$f":"IF(D19<0,ROUNDUP(D19/D62*(-1),0),0)","v":0},0,0,0]
[null,"Fehlende Anschlüsse ",null,{"$f":"D19+D27","v":0},{"$f":"E27+E19","v":0},{"$f":"F19+F27","v":0},0,{"$f":"H19","v":0},0,0,0,0]
[null,"AI auf DI Fehlende Anschlüsse","ben. AI",{"$f":"IF(AND(D29*-1<=E29,E29<0),D29-(D29+E29),IF(E29<0,D29,0))","v":0},{"$f":"IF(E29<0,E29+D29,E29)","v":0},"Entscheider ob weitere Extension"]
[null,"Fehlende Anschlüsse nach Umlegung",null,{"$f":"D29-D30","v":0},{"$f":"D30","v":0},"E29 =WENN(E28<0;E28+D28;E28)",null,null,{"$f":"IF(AND(E29<0,(E29+D29)>0),E29+D29-D30,0)","v":0}]
[null,null,null,null,{"$f":"E29+E31","v":0},null,null,null,{"$f":"IF(C34>0,C34*16+E32,0)","v":0}]
[]
[null,"Restliche Extension für DI",{"$f":"IF(E30<0,ROUNDUP(-E30/16,0),0)","v":0},{"$f":"IF(AND(C34>0,E34=0),(E30+C34*12)+C34*4,C34*4)","v":0},{"$f":"IF(AND(C34>0,ABS(E30)<C34*12),C34*12+E30,0)","v":0},{"$f":"$C$34*F62","v":0},0]
[null,"Fehlende/Überschüssige Anschlüsse ",null,{"$f":"D31+D34","v":0},{"$f":"IF(AND(C34>0,ABS(E30)<C34*12),C34*12+E30,0)","v":0},{"$f":"F29+F34","v":0},0,null,null,null,null,{"$f":"IF(G35<0,L19+G35,L19)","v":0}]
[null,null,null,null,null,"E34 =WENN((E33+E29)<0;0;E33+E29) zuvor"]
[null,"Relay Extension",{"$f":"IF(L35<0,ROUNDUP(L35/L67*(-1),0),0)","v":0},null,null,null,null,null,null,null,null,{"$f":"C37*L67","v":0}]
[null,"Fehlende Anschlüsse ",null,{"$f":"D35","v":0},0,0,{"$f":"IF(G35>0,G35,0)","v":0},{"$f":"H29","v":0},0,0,null,{"$f":"SUM(L35:L37)","v":0}]
[null,"1-Wire Extension",{"$f":"IF(H38<0,ROUNDUP(H38/H64*(-1),0),0)","v":0},null,null,null,null,{"$f":"C39*H64","v":0}]
[null,"Fehlende Anschlüsse ",null,{"$f":"SUM(D38:D39)","v":0},0,0,0,0,0,0,null,{"$f":"SUM(L38:L39)","v":0}]
[null,"EnOcean-Extension",{"$f":"IF(J40<0,ROUNDUP(J40/J65*(-1),0),0)","v":0},null,null,null,null,null,null,{"$f":"C41*J65","v":0}]
[null,"Fehlende Anschlüsse ",null,null,{"$f":"SUM(E40:E41)","v":0},0,0,0,0,0,{"$f":"K29","v":0},{"$f":"SUM(L40:L41)","v":0}]
[null,"AirBaseExtension",{"$f":"IF(I42<0,ROUNDUP(I42/I68*(-1),0),0)","v":0},null,null,null,null,null,{"$f":"C43*I68","v":0}]
[null,"Tree Extension",{"$f":"IF(K42<0,ROUNDUP(K42/K71*(-1),0),0)","v":0},null,null,null,null,null,null,null,{"$f":"C44*K71","v":0}]
[null,"Dali Extension",{"$f":"IF((N23+N22)<0,ROUNDUP((N23+N22)/N72*(-1),0),0)","v":0},"Eine Extension unter \"MS + Ext.\" zählt nun ebenfalls zu den channels dazu und wird nichtmehr extra addiert"]
[null,"Zusätzlicher Miniserver (Basis Extensions)",{"$f":"IF(C57>1,C57-1,0)","v":0},{"$f":"$C$46*D5","v":0},0,0,0]
[null,"Reserve nach Abdeckung fehlender Anschlüsse",null,{"$f":"D40+D46","v":0},{"$f":"SUM(E42:E46)","v":0},0,0,0,0,0,{"$f":"SUM(K42:K44)","v":0},{"$f":"SUM(L42:L46)","v":0}]
[]
[]
[]
[null,"Anschlüsse nach autmomatische Ergänzung von fehlenden Extensions"]
[null,"Gesamt verfügbare Anschlüsse",null,{"$f":"D22+D27+C34*4+C380*D61+D62*C381+D46","v":0},{"$f":"E22+E27+C34*12+C380*E61+C381*E62+E46+E69*(C223+C391)","v":0},{"$f":"F22+F27+F34+C380*F61+C381*F62+F46","v":0},{"$f":"G22+G27+G34+G46+C380*G61+C381*G62","v":0},{"$f":"H22+H39+C385*H64+(C223+C391)*H69","v":0},{"$f":"I22+I43+(C221+C390)*I68","v":0},0,0,{"$f":"L22+L37+C389*L67+(C223+C391)*L69","v":0},null,null,{"$f":"N22+C45*N72","v":0}]
[null,"Benötigte Anschlüsse",-1.0,{"$f":"ABS(D4)+D30+C34*4-D34","v":0},{"$f":"ABS(E4)-E31-(C34*4-D34)","v":0},{"$f":"F4*$C$53","v":0},{"$f":"G4*$C$53+IF(G35<0,G35,0)","v":0},{"$f":"H4*$C$53","v":0},0,0,{"$f":"K23+K44+(E222+E391)*K69","v":0},{"$f":"L4*$C$53-IF(G35<0,G35,0)","v":0},null,null,{"$f":"C497","v":0}]
[null,"Übrigbleibende Anschlüsse",null,{"$f":"D52-D53","v":0},0,0,0,0,0,0,{"$f":"K24+K46+(E223+E392)*K70","v":0},{"$f":"L52-L53","v":0},null,null,{"$f":"O52-O53","v":0}]
[]
[null,"Gesamtanzahl Extensions",{"$f":"Products!B8+Products!B11+Products!B12+Products!B13+Products!B14+Products!B15+Products!B21+Products!B23+Products!B24+Products!B26+Products!B28+Products!B40","v":0}]
[null,"Benötigte Miniserver inkl. Extensions",{"$f":"ROUNDUP(C56/30,0)","v":0}]
[]
[]
[null,null,null,"AI (Eingang)","DI (Eingang)","AO (Ausgang)","DO (Ausgang)","1-Wire Kanal","Air Base Kanal","EnOcean","Tree Kanal","DO 16A","DMX Kanäle","Dali Kanäle"]
[null,"Miniserver",null,{"$f":"Products!$J$7","v":4},{"$f":"Products!$K$7","v":8},{"$f":"Products!$L$7","v":4},{"$f":"Products!$M$7","v":8}]
[null,"Extension",null,{"$f":"Products!$J$8","v":4},{"$f":"Products!$K$8","v":12},{"$f":"Products!$L$8","v":4},{"$f":"Products!$M$8","v":8}]
[null,"DMX Extension",null,null,null,null,null,null,null,null,null,null,{"$f":"Products!$N$12","v":128}]
[null,"1-wire Extension",null,null,null,null,null,{"$f":"Products!$N$14","v":20}]
[null,"EnOcean Extension",null,null,null,null,null,null,null,{"$f":"Products!$N$15","v":128}]
[null,"Dimmer Extension",null,null,{"$f":"Products!$K$21","v":8},{"$f":"Products!$L$21","v":4}]
[null,"Relay Extension",null,null,null,null,null,null,null,null,null,{"$f":"Products!$M$23","v":14}]
[null,"Air Base Extension",null,null,null,null,null,null,{"$f":"Products!$N$24","v":128}]
[null,"Multi Extension Air",null,null,{"$f":"Products!$K$26","v":12},null,null,{"$f":"Products!$N$26","v":20},null,null,null,{"$f":"Products!$M$26","v":8},"Air Dimmer"]
[null,"Miniserver Go",null,null,null,null,null,null,{"$f":"Products!$N$30","v":128}]
[null,"Tree Extension",null,null,null,null,null,null,null,null,100.0]
[null,"Dali Extension",null,null,null,null,null,null,null,null,null,null,null,64.0]
[null,null,null,"Benötigte Kanäle \nauf Extension \n(Basis LED Streifen)"]
[null,"Licht","Anzahl","DMX Ext.","Air Base Ext.","DMX Frei","AO","DO","Dimmer Kanäle frei",null,"DO 16A","Tree"]
[null,{"$f":"Light!B18","v":"Light Circut (switched )"},{"$f":"IF(ISNA(VLOOKUP(B75,Main!$B$5:$C$15,2,FALSE)),0,VLOOKUP(B75,Main!$B$5:$C$15,2,FALSE))","v":0},null,null,null,null,{"$f":"1*C75","v":0}]
["100012",{"$f":"Light!B2","v":"DMX Extension"},{"$f":"IF(ISNA(VLOOKUP(B76,Main!$B$5:$C$15,2,FALSE)),0,VLOOKUP(B76,Main!$B$5:$C$15,2,FALSE))","v":0},null,null,{"$f":"Products!N12*C76","v":0}]
["100029",{"$f":"Light!B3","v":"Dimmer Channel (110V)"},{"$f":"ROUNDUP(IF(ISNA(VLOOKUP(B77,Main!$B$5:$C$15,2,FALSE)),0,VLOOKUP(B77,Main!$B$5:$C$15,2,FALSE))/4,0)","v":0},null,null,null,null,null,{"$f":"C77*4","v":0},null,null,null,null,{"$f":"ROUNDUP(IF(ISNA(VLOOKUP(B77,Main!$B$5:$C$15,2,FALSE)),0,VLOOKUP(B77,Main!$B$5:$C$15,2,FALSE)),0)","v":0}]
["100117",{"$f":"Light!B4","v":"RGBW 24V Dimmer DMX"},{"$f":"IF(ISNA(VLOOKUP(B78,Main!$B$5:$C$15,2,FALSE)),0,VLOOKUP(B78,Main!$B$5:$C$15,2,FALSE))","v":0},{"$f":"Products!N27*C78","v":0}]
["100125",{"$f":"Light!B5","v":"RGBW 24V Dimmer Air"},{"$f":"IF(ISNA(VLOOKUP(B79,Main!$B$5:$C$15,2,FALSE)),0,VLOOKUP(B79,Main!$B$5:$C$15,2,FALSE))","v":0},null,{"$f":"Products!N29*C79","v":0}]
["200042",{"$f":"Light!B6","v":"RGB LED Strip 5m"},{"$f":"IF(ISNA(VLOOKUP(B80,Main!$B$5:$C$15,2,FALSE)),0,VLOOKUP(B80,Main!$B$5:$C$15,2,FALSE))","v":0},null,null,null,null,null,"Slots Licht","DMX Ext."]
["200043",{"$f":"Light!B7","v":"Warm White LED Strip 5m"},{"$f":"IF(ISNA(VLOOKUP(B81,Main!$B$5:$C$15,2,FALSE)),0,VLOOKUP(B81,Main!$B$5:$C$15,2,FALSE))","v":0},null,null,null,null,null,"Verfügbare Kanäle",{"$f":"F76","v":0}]
["200045","RGB Streifen - gelöscht",{"$f":"IF(ISNA(VLOOKUP(B82,Main!$B$5:$C$15,2,FALSE)),0,VLOOKUP(B82,Main!$B$5:$C$15,2,FALSE))","v":0},null,null,null,null,null,"Benötigte Kanäle",{"$f":"D78","v":0}]
["200046",{"$f":"Light!B8","v":"RGB LED Strip 5m IP68"},{"$f":"IF(ISNA(VLOOKUP(B83,Main!$B$5:$C$15,2,FALSE)),0,VLOOKUP(B83,Main!$B$5:$C$15,2,FALSE))","v":0},null,null,null,null,null,"Fehlende Kanäle",{"$f":"IF(J82>J81,J82-J81,0)","v":0}]
["200061",{"$f":"Light!B10","v":"Warm White LED Strip 5m IP65"},{"$f":"IF(ISNA(VLOOKUP(B84,Main!$B$5:$C$15,2,FALSE)),0,VLOOKUP(B84,Main!$B$5:$C$15,2,FALSE))","v":0},null,null,null,null,null,"Reserve",{"$f":"IF(J81>J82,J81-J82,0)","v":0}]
["200092",{"$f":"Light!B11","v":"Warm White LED Strip 5m IP68"},{"$f":"IF(ISNA(VLOOKUP(B85,Main!$B$5:$C$15,2,FALSE)),0,VLOOKUP(B85,Main!$B$5:$C$15,2,FALSE))","v":0}]
["200098",{"$f":"Light!B12","v":"RGBW LED Strip 5m IP20"},{"$f":"IF(ISNA(VLOOKUP(B86,Main!$B$5:$C$15,2,FALSE)),0,VLOOKUP(B86,Main!$B$5:$C$15,2,FALSE))","v":0},null,null,null,null,null,"DMX zusätzlich",{"$f":"ROUNDUP(J83/M63,0)","v":0}]
["200099",{"$f":"Light!B13","v":"RGBW LED Strip 5m IP65"},{"$f":"IF(ISNA(VLOOKUP(B87,Main!$B$5:$C$15,2,FALSE)),0,VLOOKUP(B87,Main!$B$5:$C$15,2,FALSE))","v":0}]
["200100",{"$f":"Light!B14","v":"RGBW LED Strip 5m IP68"},{"$f":"IF(ISNA(VLOOKUP(B88,Main!$B$5:$C$15,2,FALSE)),0,VLOOKUP(B88,Main!$B$5:$C$15,2,FALSE))","v":0}]
[200280.0,{"$f":"Light!B15","v":"LED Strip Accessories Set - RGBW"},{"$f":"IF(ISNA(VLOOKUP(B89,Main!$B$5:$C$15,2,FALSE)),0,VLOOKUP(B89,Main!$B$5:$C$15,2,FALSE))","v":0}]
[200278.0,{"$f":"Light!B16","v":"LED Strip Accessories Set - Warm White"},{"$f":"IF(ISNA(VLOOKUP(B90,Main!$B$5:$C$15,2,FALSE)),0,VLOOKUP(B90,Main!$B$5:$C$15,2,FALSE))","v":0}]
[null,{"$f":"Light!B17","v":"Analogue 1-10V"},{"$f":"IF(ISNA(VLOOKUP(B91,Main!$B$5:$C$15,2,FALSE)),0,VLOOKUP(B91,Main!$B$5:$C$15,2,FALSE))","v":0},null,null,null,{"$f":"1*C91","v":0}]
[100153.0,{"$f":"Light!B9","v":"Nano IO Air"},{"$f":"IF(ISNA(VLOOKUP(B92,Main!$B$5:$C$15,2,FALSE)),0,VLOOKUP(B92,Main!$B$5:$C$15,2,FALSE))","v":0},null,{"$f":"Products!N37*C92","v":0}]
["100204",{"$f":"Light!B19","v":"LED Spot RGBW"},{"$f":"IF(ISNA(VLOOKUP(B93,Main!$B$5:$C$15,2,FALSE)),0,VLOOKUP(B93,Main!$B$5:$C$15,2,FALSE))","v":0}]
["100203",{"$f":"Light!B20","v":"LED Spot Warm White"},{"$f":"IF(ISNA(VLOOKUP(B94,Main!$B$5:$C$15,2,FALSE)),0,VLOOKUP(B94,Main!$B$5:$C$15,2,FALSE))","v":0}]
[null,{"$f":"Light!B22","v":"Circut (switched ) 16A"},{"$f":"IF(ISNA(VLOOKUP(B95,Main!$B$5:$C$15,2,FALSE)),0,VLOOKUP(B95,Main!$B$5:$C$15,2,FALSE))","v":0},null,null,null,null,null,null,null,{"$f":"C95*1","v":0}]
[null,{"$f":"Light!B23","v":"LED Ceiling Spot RGBW"},{"$f":"IF(ISNA(VLOOKUP(B96,Main!$B$5:$C$15,2,FALSE)),0,VLOOKUP(B96,Main!$B$5:$C$15,2,FALSE))","v":0}]
[null,{"$f":"Light!B24","v":"LED Ceiling Spot WW"},{"$f":"IF(ISNA(VLOOKUP(B97,Main!$B$5:$C$15,2,FALSE)),0,VLOOKUP(B97,Main!$B$5:$C$15,2,FALSE))","v":0}]
[null,{"$f":"Light!B25","v":"LED Ceiling Spot Tree RGBW"},{"$f":"IF(ISNA(VLOOKUP(B98,Main!$B$5:$C$15,2,FALSE)),0,VLOOKUP(B98,Main!$B$5:$C$15,2,FALSE))","v":0},null,null,null,null,null,null,null,null,{"$f":"C98","v":0}]
[null,{"$f":"Light!B26","v":"LED Ceiling Spot Tree WW"},{"$f":"IF(ISNA(VLOOKUP(B99,Main!$B$5:$C$15,2,FALSE)),0,VLOOKUP(B99,Main!$B$5:$C$15,2,FALSE))","v":0},null,null,null,null,null,null,null,null,0]
[null,{"$f":"Light!B27","v":"LED Spot Tree WW"},{"$f":"IF(ISNA(VLOOKUP(B100,Main!$B$5:$C$15,2,FALSE)),0,VLOOKUP(B100,Main!$B$5:$C$15,2,FALSE))","v":0},null,null,null,null,null,null,null,null,0]
[null,{"$f":"Light!B28","v":"LED Spot Tree RGBW"},{"$f":"IF(ISNA(VLOOKUP(B101,Main!$B$5:$C$15,2,FALSE)),0,VLOOKUP(B101,Main!$B$5:$C$15,2,FALSE))","v":0},null,null,null,null,null,null,null,null,0]
[null,{"$f":"Light!B29","v":"RGBW 24V Dimmer Tree"},{"$f":"IF(ISNA(VLOOKUP(B102,Main!$B$5:$C$15,2,FALSE)),0,VLOOKUP(B102,Main!$B$5:$C$15,2,FALSE))","v":0},null,null,null,null,null,null,null,null,0]
[null,null,"Summe",{"$f":"SUM(D75:D102)","v":0},0,0,0,0,null,null,{"$f":"SUM(K75:K95)","v":0},{"$f":"SUM(L75:L102)","v":0}]
[]
[null,"Information"]
[null,"Pro Streifen 1 Dimmer & Pro Dimmer 1 Netzteil"]
[null,"DMX Dimmer belegt immer 4 Kanäle auf DMX Extension"]
[null,"Dimmer Air belegt 1 Kanal auf Air Base Extension"]
[null,"Da Dimmer auch ausgewählt wird, verfügbare, benötigte, reserve und noch notwendige Kanäle berechnen"]
[null,"Berechnung Kanäle auf Basis Dimmer nicht Streifen"]
[null,"Netzteilrechner: Spalte mit Watt pro Streifen"]
[null,null,null,null,null,null,null,null,"Zusätzlich benötigt"]
[null,"2 Mal 1 Produkt auswählen geht nicht, weil Anzahl nicht zusammengezählt wird!",null,null,null,null,null,null,"Air Base Extension"]
[null,null,null,null,null,null,null,null,"Miniserver"]
[]
[null,"Musik","Anzahl Stück",0.0]
["100165",{"$f":"Music!B3","v":"Loxone Music Server 4 Zone"},{"$f":"IF(ISNA(VLOOKUP(B117,Main!$B$64:$C$72,2,FALSE)),0,VLOOKUP(B117,Main!$B$64:$C$72,2,FALSE))","v":0},0.0]
["100166",{"$f":"Music!B4","v":"Loxone Music Server 8 Zone"},{"$f":"IF(ISNA(VLOOKUP(B118,Main!$B$64:$C$72,2,FALSE)),0,VLOOKUP(B118,Main!$B$64:$C$72,2,FALSE))","v":0},0.0]
["100167",{"$f":"Music!B5","v":"Loxone Music Server 12 Zone"},{"$f":"IF(ISNA(VLOOKUP(B119,Main!$B$64:$C$72,2,FALSE)),0,VLOOKUP(B119,Main!$B$64:$C$72,2,FALSE))","v":0},0.0,null,"Loxone Music Server 4",null,{"$f":"IF(C128>(H123*20+H122*16+H121*12+H120*8),ROUNDUP((C128-H123*20-H122*16-H121*12-H120*8)/4,0),0)","v":0}]
["100168",{"$f":"Music!B6","v":"Loxone Music Server 16 Zone"},{"$f":"IF(ISNA(VLOOKUP(B120,Main!$B$64:$C$72,2,FALSE)),0,VLOOKUP(B120,Main!$B$64:$C$72,2,FALSE))","v":0},0.0,null,"Loxone Music Server 8",null,{"$f":"IF((C128-H123*20-H122*16-H121*12)<=4,0,IF((C128>(H123*20+H122*16+H121*12)),ROUNDUP((C128-H123*20-H122*16-H121*12)/8,0),0))","v":0}]
["100169",{"$f":"Music!B7","v":"Loxone Music Server 20 Zone"},{"$f":"IF(ISNA(VLOOKUP(B121,Main!$B$64:$C$72,2,FALSE)),0,VLOOKUP(B121,Main!$B$64:$C$72,2,FALSE))","v":0},0.0,null,"Loxone Music Server 12",null,{"$f":"IF((C128-H123*20-H122*16)<=8,0,IF((C128>(H123*20+H122*16)),ROUNDUP((C128-H123*20-H122*16)/12,0),0))","v":0}]
["200097",{"$f":"Music!B8","v":"Loxone Speaker"},{"$f":"IF(ISNA(VLOOKUP(B122,Main!$B$64:$C$72,2,FALSE)),0,VLOOKUP(B122,Main!$B$64:$C$72,2,FALSE))","v":0},"Message box sperren",null,"Loxone Music Server 16",null,{"$f":"IF((C128-H123*20)<=12,0,IF((C128>H123*20),ROUNDUP((C128-H123*20)/16,0),0))","v":0}]
["200110",{"$f":"Music!B9","v":"Loxone 12 Channel Amplifier"},{"$f":"IF(ISNA(VLOOKUP(B123,Main!$B$64:$C$72,2,FALSE)),0,VLOOKUP(B123,Main!$B$64:$C$72,2,FALSE))","v":0},0.0,null,"Loxone Music Server 20",null,{"$f":"IF(OR(C128=17,C128=18,C128=19,C128=37,C128=38,C128=39),1,0)+I123","v":0},{"$f":"ROUNDDOWN(C128/20,0)","v":0}]
["200150",{"$f":"Music!B10","v":"Loxone Speaker Back Box"},{"$f":"IF(ISNA(VLOOKUP(B124,Main!$B$64:$C$72,2,FALSE)),0,VLOOKUP(B124,Main!$B$64:$C$72,2,FALSE))","v":0}]
["100205",{"$f":"Music!B13","v":"Loxone Music Server Upgrade"},{"$f":"IF(ISNA(VLOOKUP(B125,Main!$B$64:$C$72,2,FALSE)),0,VLOOKUP(B125,Main!$B$64:$C$72,2,FALSE))","v":0}]
["200202",{"$f":"Music!B12","v":"Loxone Speaker Back Box For Suspended Ceilings"},{"$f":"IF(ISNA(VLOOKUP(B126,Main!$B$64:$C$72,2,FALSE)),0,VLOOKUP(B126,Main!$B$64:$C$72,2,FALSE))","v":0}]
["200153",{"$f":"Music!B11","v":"Loxone Wall Speaker"},{"$f":"IF(ISNA(VLOOKUP(B127,Main!$B$64:$C$72,2,FALSE)),0,VLOOKUP(B127,Main!$B$64:$C$72,2,FALSE))","v":0}]
[null,{"$f":"Music!B2","v":"Music Server Zone"},{"$f":"IF(ISNA(VLOOKUP(B128,Main!$B$64:$C$72,2,FALSE)),0,VLOOKUP(B128,Main!$B$64:$C$72,2,FALSE))","v":0}]
[]
[null,"Heizung","Anzahl Stück",null,"AI","AO","DO","1-Wire",null,null,"Tree"]
["100163",{"$f":"Heating!B2","v":""},{"$f":"IF(ISNA(VLOOKUP(B131,Main!$B$21:$C$25,2,FALSE)),0,VLOOKUP(B131,Main!$B$21:$C$25,2,FALSE))","v":0},null,null,null,null,null,{"$f":"C131","v":0}]
["200003",{"$f":"Heating!B3","v":""},{"$f":"IF(ISNA(VLOOKUP(B132,Main!$B$21:$C$25,2,FALSE)),0,VLOOKUP(B132,Main!$B$21:$C$25,2,FALSE))","v":0},null,{"$f":"Products!J57*C132","v":0}]
[200004.0,{"$f":"Heating!B4","v":"Valve Actuator Air"},{"$f":"IF(ISNA(VLOOKUP(B133,Main!$B$21:$C$25,2,FALSE)),0,VLOOKUP(B133,Main!$B$21:$C$25,2,FALSE))","v":0},null,null,null,null,null,{"$f":"1*C133","v":0}]
[200005.0,{"$f":"Heating!B5","v":"Outside Temperature Sensor 0-10V"},{"$f":"IF(ISNA(VLOOKUP(B134,Main!$B$21:$C$25,2,FALSE)),0,VLOOKUP(B134,Main!$B$21:$C$25,2,FALSE))","v":0},null,null,null,{"$f":"Products!M59*C134","v":0}]
[200006.0,{"$f":"Heating!B6","v":"Indoor Temperature Sensor 0-10V"},{"$f":"IF(ISNA(VLOOKUP(B135,Main!$B$21:$C$25,2,FALSE)),0,VLOOKUP(B135,Main!$B$21:$C$25,2,FALSE))","v":0},null,{"$f":"Products!J60*C135","v":0}]
[200010.0,{"$f":"Heating!B7","v":"Indoor Temperature & Humidity Sensor 0-10V"},{"$f":"IF(ISNA(VLOOKUP(B136,Main!$B$21:$C$25,2,FALSE)),0,VLOOKUP(B136,Main!$B$21:$C$25,2,FALSE))","v":0},null,{"$f":"Products!J62*C136","v":0}]
[200017.0,{"$f":"Heating!B8","v":"Indoor Temperature, Humidty & CO2 Sensor 0-10V"},{"$f":"IF(ISNA(VLOOKUP(B137,Main!$B$21:$C$25,2,FALSE)),0,VLOOKUP(B137,Main!$B$21:$C$25,2,FALSE))","v":0},null,{"$f":"Products!J65*C137","v":0}]
[200077.0,{"$f":"Heating!B9","v":"Temperature Probe 1-Wire"},{"$f":"IF(ISNA(VLOOKUP(B138,Main!$B$21:$C$25,2,FALSE)),0,VLOOKUP(B138,Main!$B$21:$C$25,2,FALSE))","v":0},null,null,null,null,{"$f":"Products!N87*C138","v":0}]
[200109.0,{"$f":"Heating!B10","v":"1-Wire Temperature Sensor"},{"$f":"ROUNDUP(IF(ISNA(VLOOKUP(B139,Main!$B$21:$C$25,2,FALSE)),0,VLOOKUP(B139,Main!$B$21:$C$25,2,FALSE))/5,0)","v":0},null,null,null,null,{"$f":"Products!N103*C139","v":0}]
[null,{"$f":"Heating!B11","v":"Valve Actuator Tree"},{"$f":"IF(ISNA(VLOOKUP(B140,Main!$B$21:$C$25,2,FALSE)),0,VLOOKUP(B140,Main!$B$21:$C$25,2,FALSE))","v":0},null,null,null,null,null,null,null,{"$f":"C140*Products!N154","v":0}]
[null,null,null,"Summe",{"$f":"SUM(E131:E139)","v":0},0,0,0,0,null,{"$f":"SUM(K133:K140)","v":0},0]
[]
[null,null,null,null,null,null,null,null,"Zusätzlich benötigt"]
[null,null,null,null,null,null,null,null,"1-Wire Extension"]
[null,null,null,null,null,null,null,null,"Extension"]
[null,null,null,null,null,null,null,null,"Miniserver"]
[]
[]
[null,"Zutritt","Anzahl","1-Wire"]
["200063",{"$f":"Entry!B2","v":"iButton Reader 1-Wire"},{"$f":"IF(ISNA(VLOOKUP(B150,Main!$B$59:$C$62,2,FALSE)),0,VLOOKUP(B150,Main!$B$59:$C$62,2,FALSE))","v":0},{"$f":"Products!N83*C150","v":0},"Jeder Leser 1 Extension, außer es ist schon eine 1-Wire Extension vorhanden, dann hat dort 1 Leser platz"]
["200064",{"$f":"Entry!B3","v":"iButton Electronic Key Fob"},{"$f":"IF(ISNA(VLOOKUP(B151,Main!$B$59:$C$62,2,FALSE)),0,VLOOKUP(B151,Main!$B$59:$C$62,2,FALSE))","v":0},null,null,null,"Ben. Kanäle","Ben. Ext","Freie Plätze"]
["200070",{"$f":"Entry!B4","v":"not available in this country"},{"$f":"IF(ISNA(VLOOKUP(B152,Main!$B$59:$C$62,2,FALSE)),0,VLOOKUP(B152,Main!$B$59:$C$62,2,FALSE))","v":0},null,null,"Summe Leser",{"$f":"D160","v":0},{"$f":"G152","v":0},{"$f":"(G155+H152)*20","v":0}]
["200076",null,null,null,null,"S. Heizung",{"$f":"H4*(-1)-G152","v":0},{"$f":"IF(I152<G153,ROUNDUP((G153-I152)/20,0),0)","v":0}]
["200082"]
["200093",{"$f":"Entry!B5","v":"Loxone Intercom"},{"$f":"IF(ISNA(VLOOKUP(B155,Main!$B$59:$C$62,2,FALSE)),0,VLOOKUP(B155,Main!$B$59:$C$62,2,FALSE))","v":0},null,null,"vorh. Ext.",{"$f":"C385","v":0}]
["200094",{"$f":"Entry!B6","v":"Flush-mounted box for the Loxone intercom"},{"$f":"IF(ISNA(VLOOKUP(B156,Main!$B$59:$C$62,2,FALSE)),0,VLOOKUP(B156,Main!$B$59:$C$62,2,FALSE))","v":0}]
["200095",{"$f":"Entry!B7","v":"Surface Box for Loxone Intercom"},{"$f":"IF(ISNA(VLOOKUP(B157,Main!$B$59:$C$62,2,FALSE)),0,VLOOKUP(B157,Main!$B$59:$C$62,2,FALSE))","v":0},null,null,null,{"$f":"IF(D160>(C39+C12),1,0)","v":0}]
["200191",{"$f":"Entry!B8","v":"iButton Reader 1-Wire Outdoor"},{"$f":"IF(ISNA(VLOOKUP(B158,Main!$B$59:$C$62,2,FALSE)),0,VLOOKUP(B158,Main!$B$59:$C$62,2,FALSE))","v":0},{"$f":"Products!N137*C158","v":0}]
["200273",{"$f":"Entry!B9","v":"Loxone Intercom XL"},{"$f":"IF(ISNA(VLOOKUP(B159,Main!$B$59:$C$62,2,FALSE)),0,VLOOKUP(B159,Main!$B$59:$C$62,2,FALSE))","v":0}]
[null,null,"Summe",{"$f":"SUM(D150:D159)","v":0}]
[]
[null,"Information",null,null,null,null,null,null,"Zusätzlich benötigt"]
[null,"1-Wire Extension (20 Slots) benötigt",null,null,null,null,null,null,"1-Wire Extension"]
[null,"1 Lesegerät = 1 Slot",null,null,null,null,null,null,"Miniserver"]
[]
[]
[null,"Sensoren","Anzahl","AI","DI",null,"1-Wire",null,null,null,"Tree","AIR"]
[200003.0,{"$f":"Sensors!B2","v":"Outside Temperature Sensor 0-10V"},{"$f":"IF(ISNA(VLOOKUP(B168,Main!$B$27:$C$32,2,FALSE)),0,VLOOKUP(B168,Main!$B$27:$C$32,2,FALSE))","v":0},{"$f":"Products!J57*C168","v":0}]
[200006.0,{"$f":"Sensors!B3","v":"Indoor Temperature Sensor 0-10V"},{"$f":"IF(ISNA(VLOOKUP(B169,Main!$B$27:$C$32,2,FALSE)),0,VLOOKUP(B169,Main!$B$27:$C$32,2,FALSE))","v":0},{"$f":"Products!J60*C169","v":0}]
[200010.0,{"$f":"Sensors!B4","v":"Indoor Temperature & Humidity Sensor 0-10V"},{"$f":"IF(ISNA(VLOOKUP(B170,Main!$B$27:$C$32,2,FALSE)),0,VLOOKUP(B170,Main!$B$27:$C$32,2,FALSE))","v":0},{"$f":"Products!J62*C170","v":0}]
[200017.0,{"$f":"Sensors!B5","v":"Indoor Temperature, Humidty & CO2 Sensor 0-10V"},{"$f":"IF(ISNA(VLOOKUP(B171,Main!$B$27:$C$32,2,FALSE)),0,VLOOKUP(B171,Main!$B$27:$C$32,2,FALSE))","v":0},{"$f":"Products!J65*C171","v":0}]
["200018",{"$f":"Sensors!B6","v":"Rain Sensor (24V)"},{"$f":"IF(ISNA(VLOOKUP(B172,Main!$B$27:$C$32,2,FALSE)),0,VLOOKUP(B172,Main!$B$27:$C$32,2,FALSE))","v":0},null,{"$f":"Products!K66*C172","v":0}]
["200031",{"$f":"Sensors!B7","v":"Outdoor Temperature & Humidy Sensor 0-10V"},{"$f":"IF(ISNA(VLOOKUP(B173,Main!$B$27:$C$32,2,FALSE)),0,VLOOKUP(B173,Main!$B$27:$C$32,2,FALSE))","v":0},{"$f":"Products!J67*C173","v":0}]
["200032",{"$f":"Sensors!B8","v":"Brightness Sensor 0-10V"},{"$f":"IF(ISNA(VLOOKUP(B174,Main!$B$27:$C$32,2,FALSE)),0,VLOOKUP(B174,Main!$B$27:$C$32,2,FALSE))","v":0},{"$f":"Products!J68*C174","v":0}]
["200033",{"$f":"Sensors!B9","v":"Windsensor 24V"},{"$f":"IF(ISNA(VLOOKUP(B175,Main!$B$27:$C$32,2,FALSE)),0,VLOOKUP(B175,Main!$B$27:$C$32,2,FALSE))","v":0},null,{"$f":"Products!K69*C175","v":0}]
["200034",{"$f":"Sensors!B10","v":"Wind Sensor Mount"},{"$f":"IF(ISNA(VLOOKUP(B176,Main!$B$27:$C$32,2,FALSE)),0,VLOOKUP(B176,Main!$B$27:$C$32,2,FALSE))","v":0},null,null,"Stück"]
["200054",{"$f":"Sensors!B11","v":"Ultrasonic Sensor 0-10V"},{"$f":"IF(ISNA(VLOOKUP(B177,Main!$B$27:$C$32,2,FALSE)),0,VLOOKUP(B177,Main!$B$27:$C$32,2,FALSE))","v":0},{"$f":"Products!J79*C177","v":0}]
[200077.0,{"$f":"Sensors!B12","v":"Temperature Probe 1-Wire"},{"$f":"IF(ISNA(VLOOKUP(B178,Main!$B$27:$C$32,2,FALSE)),0,VLOOKUP(B178,Main!$B$27:$C$32,2,FALSE))","v":0},null,null,null,null,{"$f":"Products!N87*C178","v":0}]
["200101",{"$f":"Sensors!B13","v":"Water Sensor"},{"$f":"IF(ISNA(VLOOKUP(B179,Main!$B$27:$C$32,2,FALSE)),0,VLOOKUP(B179,Main!$B$27:$C$32,2,FALSE))","v":0},null,{"$f":"Products!K101*C179","v":0}]
[200109.0,{"$f":"Sensors!B14","v":"Temperature Sensor Set 1-Wire"},{"$f":"IF(ISNA(VLOOKUP(B180,Main!$B$27:$C$32,2,FALSE)),0,VLOOKUP(B180,Main!$B$27:$C$32,2,FALSE))","v":0},null,null,null,null,{"$f":"Products!N103*C180","v":0}]
["200112",{"$f":"Sensors!B15","v":"Outside Motion Sensor (24V)"},{"$f":"IF(ISNA(VLOOKUP(B181,Main!$B$27:$C$32,2,FALSE)),0,VLOOKUP(B181,Main!$B$27:$C$32,2,FALSE))","v":0},null,{"$f":"Products!K105*C181","v":0}]
[null,{"$f":"Sensors!B16","v":"Window Contact (integrated - only reserve DI)"},{"$f":"IF(ISNA(VLOOKUP(B182,Main!$B$27:$C$32,2,FALSE)),0,VLOOKUP(B182,Main!$B$27:$C$32,2,FALSE))","v":0},null,{"$f":"C182","v":0}]
["200113",{"$f":"Sensors!B17","v":"Window & Door Contact"},{"$f":"IF(ISNA(VLOOKUP(B183,Main!$B$27:$C$32,2,FALSE)),0,VLOOKUP(B183,Main!$B$27:$C$32,2,FALSE))","v":0},null,{"$f":"Products!K106*C183","v":0}]
["200136",{"$f":"Sensors!B18","v":"Temperature & Humidity Sensor For Saunas"},{"$f":"IF(ISNA(VLOOKUP(B184,Main!$B$27:$C$32,2,FALSE)),0,VLOOKUP(B184,Main!$B$27:$C$32,2,FALSE))","v":0},{"$f":"Products!J109*C184","v":0}]
["200154",{"$f":"Sensors!B19","v":"Pressure Sensor 0-10V"},{"$f":"IF(ISNA(VLOOKUP(B185,Main!$B$27:$C$32,2,FALSE)),0,VLOOKUP(B185,Main!$B$27:$C$32,2,FALSE))","v":0},{"$f":"Products!J115*C185","v":0}]
["200155",{"$f":"Sensors!B20","v":"Glass Break Sensor 24V"},{"$f":"IF(ISNA(VLOOKUP(B186,Main!$B$27:$C$32,2,FALSE)),0,VLOOKUP(B186,Main!$B$27:$C$32,2,FALSE))","v":0},null,{"$f":"Products!K116*C186","v":0}]
[null,{"$f":"Sensors!B21","v":"Motion Sensor Tree Black"},{"$f":"IF(ISNA(VLOOKUP(B187,Main!$B$27:$C$32,2,FALSE)),0,VLOOKUP(B187,Main!$B$27:$C$32,2,FALSE))","v":0},null,null,null,null,null,null,null,{"$f":"C187*Products!N152","v":0}]
[null,{"$f":"Sensors!B22","v":"Motion Sensor Tree White"},{"$f":"IF(ISNA(VLOOKUP(B188,Main!$B$27:$C$32,2,FALSE)),0,VLOOKUP(B188,Main!$B$27:$C$32,2,FALSE))","v":0},null,null,null,null,null,null,null,{"$f":"C188*Products!N153","v":0}]
[null,{"$f":"Sensors!B23","v":"Water Sensor Air"},{"$f":"IF(ISNA(VLOOKUP(B189,Main!$B$27:$C$32,2,FALSE)),0,VLOOKUP(B189,Main!$B$27:$C$32,2,FALSE))","v":0},null,null,null,null,null,{"$f":"C189*Products!N154","v":0},null,null,{"$f":"C189","v":0}]
[null,{"$f":"Sensors!B24","v":"Door & Window Contact Air Black"},{"$f":"IF(ISNA(VLOOKUP(B190,Main!$B$27:$C$32,2,FALSE)),0,VLOOKUP(B190,Main!$B$27:$C$32,2,FALSE))","v":0},null,null,null,null,null,{"$f":"C190*Products!N155","v":0},null,null,0]
[null,{"$f":"Sensors!B25","v":"Door & Window Contact Air White"},{"$f":"IF(ISNA(VLOOKUP(B191,Main!$B$27:$C$32,2,FALSE)),0,VLOOKUP(B191,Main!$B$27:$C$32,2,FALSE))","v":0},null,null,null,null,null,{"$f":"C191*Products!N156","v":0},null,null,0]
[null,{"$f":"Sensors!B26","v":"Digital IN (Reserve)"},{"$f":"IF(ISNA(VLOOKUP(B192,Main!$B$27:$C$32,2,FALSE)),0,VLOOKUP(B192,Main!$B$27:$C$32,2,FALSE))","v":0},null,{"$f":"C192","v":0}]
[null,{"$f":"Sensors!B27","v":"Analog IN (Reserve)"},{"$f":"IF(ISNA(VLOOKUP(B193,Main!$B$27:$C$32,2,FALSE)),0,VLOOKUP(B193,Main!$B$27:$C$32,2,FALSE))","v":0},{"$f":"C193","v":0}]
[null,{"$f":"Products!D187","v":"Window Handle Air"},{"$f":"IF(ISNA(VLOOKUP(B194,Main!$B$27:$C$32,2,FALSE)),0,VLOOKUP(B194,Main!$B$27:$C$32,2,FALSE))","v":0},null,null,null,null,null,null,null,null,{"$f":"C194","v":0}]
[null,null,"Summe",{"$f":"SUM(D168:D194)","v":0},{"$f":"SUM(E172:E194)","v":0},null,null,{"$f":"SUM(H172:H186)","v":0},{"$f":"SUM(I172:I191)","v":0},0,0,{"$f":"SUM(L168:L194)","v":0}]
[]
[]
[null,"Verteiler","Anzahl"]
["200168",{"$f":"Distributors!B2","v":"Push In Terminal Block 8x4 Interconnected (20 pcs)"},{"$f":"IF(ISNA(VLOOKUP(B199,Main!$B$81:$C$90,2,FALSE)),0,VLOOKUP(B199,Main!$B$81:$C$90,2,FALSE))","v":0}]
["200169",{"$f":"Distributors!B3","v":"Push In Terminal Block 8x4 Seperated (20pcs)"},{"$f":"IF(ISNA(VLOOKUP(B200,Main!$B$81:$C$90,2,FALSE)),0,VLOOKUP(B200,Main!$B$81:$C$90,2,FALSE))","v":0}]
["200170",{"$f":"Distributors!B4","v":"Partition for 8x4 Terminals (10pcs)"},{"$f":"IF(ISNA(VLOOKUP(B201,Main!$B$81:$C$90,2,FALSE)),0,VLOOKUP(B201,Main!$B$81:$C$90,2,FALSE))","v":0}]
["200171",{"$f":"Distributors!B5","v":"Label Holder 8 Levels (20 pcs)"},{"$f":"IF(ISNA(VLOOKUP(B202,Main!$B$81:$C$90,2,FALSE)),0,VLOOKUP(B202,Main!$B$81:$C$90,2,FALSE))","v":0}]
["200172",{"$f":"Distributors!B6","v":"End Plate for 8x4 Terminals (10 pcs)"},{"$f":"IF(ISNA(VLOOKUP(B203,Main!$B$81:$C$90,2,FALSE)),0,VLOOKUP(B203,Main!$B$81:$C$90,2,FALSE))","v":0}]
["200173",{"$f":"Distributors!B7","v":"Push In Terminal Block 3+Earth (50 pcs)"},{"$f":"IF(ISNA(VLOOKUP(B204,Main!$B$81:$C$90,2,FALSE)),0,VLOOKUP(B204,Main!$B$81:$C$90,2,FALSE))","v":0}]
["200174",{"$f":"Distributors!B8","v":"End Plate for 3+Earth Terminals (20 pcs)"},{"$f":"IF(ISNA(VLOOKUP(B205,Main!$B$81:$C$90,2,FALSE)),0,VLOOKUP(B205,Main!$B$81:$C$90,2,FALSE))","v":0}]
["200175",{"$f":"Distributors!B9","v":"Push In Terminal Block Twin+Earth (50 pcs)"},{"$f":"IF(ISNA(VLOOKUP(B206,Main!$B$81:$C$90,2,FALSE)),0,VLOOKUP(B206,Main!$B$81:$C$90,2,FALSE))","v":0}]
["200176",{"$f":"Distributors!B10","v":"End Bracket (20 pcs)"},{"$f":"IF(ISNA(VLOOKUP(B207,Main!$B$81:$C$90,2,FALSE)),0,VLOOKUP(B207,Main!$B$81:$C$90,2,FALSE))","v":0}]
["200177",{"$f":"Distributors!B11","v":"End Plate for Twin+Earth Terminals (20 pcs)"},{"$f":"IF(ISNA(VLOOKUP(B208,Main!$B$81:$C$90,2,FALSE)),0,VLOOKUP(B208,Main!$B$81:$C$90,2,FALSE))","v":0}]
["200178",{"$f":"Distributors!B12","v":"Push in Fused Terminal Block (25 pcs)"},{"$f":"IF(ISNA(VLOOKUP(B209,Main!$B$81:$C$90,2,FALSE)),0,VLOOKUP(B209,Main!$B$81:$C$90,2,FALSE))","v":0}]
["200179",{"$f":"Distributors!B13","v":"End Plate For Fused Terminals (50 pcs)"},{"$f":"IF(ISNA(VLOOKUP(B210,Main!$B$81:$C$90,2,FALSE)),0,VLOOKUP(B210,Main!$B$81:$C$90,2,FALSE))","v":0}]
["200180",{"$f":"Distributors!B14","v":"Cross Connector For Fused Terminals (10 pcs)"},{"$f":"IF(ISNA(VLOOKUP(B211,Main!$B$81:$C$90,2,FALSE)),0,VLOOKUP(B211,Main!$B$81:$C$90,2,FALSE))","v":0}]
["200181",{"$f":"Distributors!B15","v":"Blade Fuse 2A (100 pcs)"},{"$f":"IF(ISNA(VLOOKUP(B212,Main!$B$81:$C$90,2,FALSE)),0,VLOOKUP(B212,Main!$B$81:$C$90,2,FALSE))","v":0}]
["200183",{"$f":"Distributors!B16","v":"Blade Fuse 5A (100 pcs)"},{"$f":"IF(ISNA(VLOOKUP(B213,Main!$B$81:$C$90,2,FALSE)),0,VLOOKUP(B213,Main!$B$81:$C$90,2,FALSE))","v":0}]
["200184",{"$f":"Distributors!B17","v":"Blade Fuse 10A (100 pcs)"},{"$f":"IF(ISNA(VLOOKUP(B214,Main!$B$81:$C$90,2,FALSE)),0,VLOOKUP(B214,Main!$B$81:$C$90,2,FALSE))","v":0}]
["200129",{"$f":"Distributors!B18","v":"Loxone CAT7 Cable (250m)"},{"$f":"IF(ISNA(VLOOKUP(B215,Main!$B$81:$C$90,2,FALSE)),0,VLOOKUP(B215,Main!$B$81:$C$90,2,FALSE))","v":0}]
["100150",{"$f":"Products!D35","v":"Loxone Tool Kit by Weidmüller"},{"$f":"IF(ISNA(VLOOKUP(B216,Main!$B$81:$C$90,2,FALSE)),0,VLOOKUP(B216,Main!$B$81:$C$90,2,FALSE))","v":0}]
[null,{"$f":"Products!D159","v":"Cross Connector for Mains Terminals (20 pcs)"},{"$f":"IF(ISNA(VLOOKUP(B217,Main!$B$81:$C$90,2,FALSE)),0,VLOOKUP(B217,Main!$B$81:$C$90,2,FALSE))","v":0}]
[null,{"$f":"Products!D77","v":"Coupling Relay"},{"$f":"IF(ISNA(VLOOKUP(B218,Main!$B$81:$C$90,2,FALSE)),0,VLOOKUP(B218,Main!$B$81:$C$90,2,FALSE))","v":0}]
[]
[null,"Funk","Anzahl","Air Base","EnOcean","Kanäle frei","Info"]
["100114",{"$f":"Wireless!B2","v":"Air Base Extension"},{"$f":"IF(ISNA(VLOOKUP(B221,Main!$B$41:$C$50,2,FALSE)),0,VLOOKUP(B221,Main!$B$41:$C$50,2,FALSE))","v":0},null,null,{"$f":"Products!N24*C221","v":0}]
["100115",{"$f":"Wireless!B3","v":"not available in this country"},{"$f":"IF(ISNA(VLOOKUP(B222,Main!$B$41:$C$50,2,FALSE)),0,VLOOKUP(B222,Main!$B$41:$C$50,2,FALSE))","v":0},{"$f":"Products!N25*C222","v":0}]
["100116",{"$f":"Wireless!B4","v":"Multi Extension Air"},{"$f":"IF(ISNA(VLOOKUP(B223,Main!$B$41:$C$50,2,FALSE)),0,VLOOKUP(B223,Main!$B$41:$C$50,2,FALSE))","v":0}]
["100139",{"$f":"Wireless!B5","v":"Miniserver Go"},{"$f":"IF(ISNA(VLOOKUP(B224,Main!$B$41:$C$50,2,FALSE)),0,VLOOKUP(B224,Main!$B$41:$C$50,2,FALSE))","v":0},null,null,{"$f":"Products!N30*C224","v":0}]
["100140",{"$f":"Wireless!B6","v":"Remote Air"},{"$f":"IF(ISNA(VLOOKUP(B225,Main!$B$41:$C$50,2,FALSE)),0,VLOOKUP(B225,Main!$B$41:$C$50,2,FALSE))","v":0},{"$f":"Products!N31*C225","v":0}]
["100141",{"$f":"Wireless!B7","v":"IR Control Air"},{"$f":"IF(ISNA(VLOOKUP(B226,Main!$B$41:$C$50,2,FALSE)),0,VLOOKUP(B226,Main!$B$41:$C$50,2,FALSE))","v":0},{"$f":"Products!N32*C226","v":0}]
["100142",{"$f":"Wireless!B8","v":"Smoke Detector Air"},{"$f":"IF(ISNA(VLOOKUP(B227,Main!$B$41:$C$50,2,FALSE)),0,VLOOKUP(B227,Main!$B$41:$C$50,2,FALSE))","v":0},{"$f":"Products!N33*C227","v":0}]
["100149",{"$f":"Wireless!B9","v":"Temperature & Humidity Sesnor Air"},{"$f":"IF(ISNA(VLOOKUP(B228,Main!$B$41:$C$50,2,FALSE)),0,VLOOKUP(B228,Main!$B$41:$C$50,2,FALSE))","v":0},{"$f":"Products!N34*C228","v":0}]
["100151",{"$f":"Wireless!B10","v":"not available in this country"},{"$f":"IF(ISNA(VLOOKUP(B229,Main!$B$41:$C$50,2,FALSE)),0,VLOOKUP(B229,Main!$B$41:$C$50,2,FALSE))","v":0},{"$f":"Products!N36*C229","v":0}]
["100154",{"$f":"Wireless!B11","v":"Loxone Touch for Nano White"},{"$f":"IF(ISNA(VLOOKUP(B230,Main!$B$41:$C$50,2,FALSE)),0,VLOOKUP(B230,Main!$B$41:$C$50,2,FALSE))","v":0}]
["100155",{"$f":"Wireless!B12","v":"Loxone Touch Air White"},{"$f":"IF(ISNA(VLOOKUP(B231,Main!$B$41:$C$50,2,FALSE)),0,VLOOKUP(B231,Main!$B$41:$C$50,2,FALSE))","v":0},{"$f":"Products!N39*C231","v":0},null,null,null,null,"Zusätzlich Benötigt"]
["100163",{"$f":"Wireless!B18","v":"Valve Actuator Air"},{"$f":"IF(ISNA(VLOOKUP(B232,Main!$B$41:$C$50,2,FALSE)),0,VLOOKUP(B232,Main!$B$41:$C$50,2,FALSE))","v":0},{"$f":"Products!N34*C232","v":0}]
["200048",{"$f":"Wireless!B19","v":"SMA Antenna 868 MHz"},{"$f":"IF(ISNA(VLOOKUP(B233,Main!$B$41:$C$50,2,FALSE)),0,VLOOKUP(B233,Main!$B$41:$C$50,2,FALSE))","v":0},null,null,null,"Stück",null,"Air Base Extension"]
["200059",{"$f":"Wireless!B37","v":"not available in this country"},{"$f":"IF(ISNA(VLOOKUP(B234,Main!$B$41:$C$50,2,FALSE)),0,VLOOKUP(B234,Main!$B$41:$C$50,2,FALSE))","v":0},null,{"$f":"Products!N81*C234","v":0},null,null,null,"EnOcean Extension"]
["200067",{"$f":"Wireless!B38","v":"not available in this country"},{"$f":"IF(ISNA(VLOOKUP(B235,Main!$B$41:$C$50,2,FALSE)),0,VLOOKUP(B235,Main!$B$41:$C$50,2,FALSE))","v":0},null,{"$f":"Products!N85*C235","v":0},null,null,null,"Miniserver"]
["200135",{"$f":"Wireless!B39","v":"not available in this country"},{"$f":"IF(ISNA(VLOOKUP(B236,Main!$B$41:$C$50,2,FALSE)),0,VLOOKUP(B236,Main!$B$41:$C$50,2,FALSE))","v":0},null,{"$f":"Products!N108*C236","v":0},null,null,null,"MiniserverGo"]
["200137",{"$f":"Wireless!B40","v":"not available in this country"},{"$f":"IF(ISNA(VLOOKUP(B237,Main!$B$41:$C$50,2,FALSE)),0,VLOOKUP(B237,Main!$B$41:$C$50,2,FALSE))","v":0},null,{"$f":"Products!N110*C237","v":0}]
["200151",{"$f":"Wireless!B20","v":"SMA Antenna 4dBi 868 MHz"},{"$f":"IF(ISNA(VLOOKUP(B238,Main!$B$41:$C$50,2,FALSE)),0,VLOOKUP(B238,Main!$B$41:$C$50,2,FALSE))","v":0},null,null,null,"Stück"]
["100180",{"$f":"Products!D50","v":"Loxone Touch Air Anthracite"},{"$f":"IF(ISNA(VLOOKUP(B239,Main!$B$41:$C$50,2,FALSE)),0,VLOOKUP(B239,Main!$B$41:$C$50,2,FALSE))","v":0},{"$f":"Products!N50*C239","v":0}]
["100181",{"$f":"Products!D51","v":"Loxone Touch for Nano Anthracite"},{"$f":"IF(ISNA(VLOOKUP(B240,Main!$B$41:$C$50,2,FALSE)),0,VLOOKUP(B240,Main!$B$41:$C$50,2,FALSE))","v":0}]
["100182",{"$f":"Products!D52","v":"not available in this country"},{"$f":"IF(ISNA(VLOOKUP(B241,Main!$B$41:$C$50,2,FALSE)),0,VLOOKUP(B241,Main!$B$41:$C$50,2,FALSE))","v":0},{"$f":"Products!N52*C241","v":0}]
["100183",{"$f":"Products!D53","v":"not available in this country"},{"$f":"IF(ISNA(VLOOKUP(B242,Main!$B$41:$C$50,2,FALSE)),0,VLOOKUP(B242,Main!$B$41:$C$50,2,FALSE))","v":0},{"$f":"Products!N53*C242","v":0}]
["100184",{"$f":"Products!D54","v":"not available in this country"},{"$f":"IF(ISNA(VLOOKUP(B243,Main!$B$41:$C$50,2,FALSE)),0,VLOOKUP(B243,Main!$B$41:$C$50,2,FALSE))","v":0},{"$f":"Products!N54*C243","v":0}]
["100190",{"$f":"Products!D145","v":"Motion Sensor Air"},{"$f":"IF(ISNA(VLOOKUP(B244,Main!$B$41:$C$50,2,FALSE)),0,VLOOKUP(B244,Main!$B$41:$C$50,2,FALSE))","v":0},{"$f":"Products!N145*C244","v":0}]
["100153",{"$f":"Products!D37","v":"Nano IO Air"},{"$f":"IF(ISNA(VLOOKUP(B245,Main!$B$41:$C$50,2,FALSE)),0,VLOOKUP(B245,Main!$B$41:$C$50,2,FALSE))","v":0},{"$f":"Products!N37*C245","v":0}]
["100211",{"$f":"Wireless!B23","v":"Water Sensor Air"},{"$f":"IF(ISNA(VLOOKUP(B246,Main!$B$41:$C$50,2,FALSE)),0,VLOOKUP(B246,Main!$B$41:$C$50,2,FALSE))","v":0},{"$f":"Products!N155*C246","v":0}]
["100213",{"$f":"Wireless!B24","v":"Door & Window Contact Air Black"},{"$f":"IF(ISNA(VLOOKUP(B247,Main!$B$41:$C$50,2,FALSE)),0,VLOOKUP(B247,Main!$B$41:$C$50,2,FALSE))","v":0},{"$f":"Products!N156*C247","v":0}]
["100210",{"$f":"Wireless!B25","v":"Door & Window Contact Air White"},{"$f":"IF(ISNA(VLOOKUP(B248,Main!$B$41:$C$50,2,FALSE)),0,VLOOKUP(B248,Main!$B$41:$C$50,2,FALSE))","v":0},{"$f":"C248","v":0}]
[null,{"$f":"Wireless!B27","v":"Touch pure for Nano White"},{"$f":"IF(ISNA(VLOOKUP(B249,Main!$B$41:$C$50,2,FALSE)),0,VLOOKUP(B249,Main!$B$41:$C$50,2,FALSE))","v":0}]
[null,{"$f":"Wireless!B26","v":"Touch pure Air White"},{"$f":"IF(ISNA(VLOOKUP(B250,Main!$B$41:$C$50,2,FALSE)),0,VLOOKUP(B250,Main!$B$41:$C$50,2,FALSE))","v":0},{"$f":"C250","v":0}]
[null,{"$f":"Wireless!B28","v":"not available in this country"},{"$f":"IF(ISNA(VLOOKUP(B251,Main!$B$41:$C$50,2,FALSE)),0,VLOOKUP(B251,Main!$B$41:$C$50,2,FALSE))","v":0},0]
[null,{"$f":"Products!D177","v":"Touch pure Nano Black"},{"$f":"IF(ISNA(VLOOKUP(B252,Main!$B$41:$C$50,2,FALSE)),0,VLOOKUP(B252,Main!$B$41:$C$50,2,FALSE))","v":0},{"$f":"0*C252","v":0}]
[null,{"$f":"Products!D179","v":"Touch pure Air Black"},{"$f":"IF(ISNA(VLOOKUP(B253,Main!$B$41:$C$50,2,FALSE)),0,VLOOKUP(B253,Main!$B$41:$C$50,2,FALSE))","v":0},{"$f":"C253","v":0}]
[null,{"$f":"Products!D187","v":"Window Handle Air"},{"$f":"IF(ISNA(VLOOKUP(B254,Main!$B$41:$C$50,2,FALSE)),0,VLOOKUP(B254,Main!$B$41:$C$50,2,FALSE))","v":0},0]
[]
[null,null,"Summe",{"$f":"SUM(D221:D255)","v":0},{"$f":"SUM(E221:E248)","v":0}]
[]
[]
[null,"Tree","Anzahl","Tree","Kanäle frei"]
[100218.0,{"$f":"Products!D150","v":"Tree Extension"},{"$f":"IF(ISNA(VLOOKUP(B260,Main!$B$34:$C$39,2,FALSE)),0,VLOOKUP(B260,Main!$B$34:$C$39,2,FALSE))","v":0}]
[100221.0,{"$f":"Products!D151","v":"Touch Tree White"},{"$f":"IF(ISNA(VLOOKUP(B261,Main!$B$34:$C$39,2,FALSE)),0,VLOOKUP(B261,Main!$B$34:$C$39,2,FALSE))","v":0},{"$f":"Products!N151*C261","v":0}]
[100222.0,{"$f":"Products!D152","v":"Touch Tree Black"},{"$f":"IF(ISNA(VLOOKUP(B262,Main!$B$34:$C$39,2,FALSE)),0,VLOOKUP(B262,Main!$B$34:$C$39,2,FALSE))","v":0},{"$f":"Products!N152*C262","v":0}]
[100223.0,{"$f":"Products!D153","v":"Motion Sensor Tree White"},{"$f":"IF(ISNA(VLOOKUP(B263,Main!$B$34:$C$39,2,FALSE)),0,VLOOKUP(B263,Main!$B$34:$C$39,2,FALSE))","v":0},{"$f":"Products!N153*C263","v":0}]
[100225.0,{"$f":"Products!D154","v":"Valve Actuator Tree"},{"$f":"IF(ISNA(VLOOKUP(B264,Main!$B$34:$C$39,2,FALSE)),0,VLOOKUP(B264,Main!$B$34:$C$39,2,FALSE))","v":0},{"$f":"Products!N154*C264","v":0}]
[100224.0,{"$f":"Products!D158","v":"Motion Sensor Tree Black"},{"$f":"IF(ISNA(VLOOKUP(B265,Main!$B$34:$C$39,2,FALSE)),0,VLOOKUP(B265,Main!$B$34:$C$39,2,FALSE))","v":0},{"$f":"Products!N155*C265","v":0}]
[null,{"$f":"Products!D162","v":"Touch pure Air White"},{"$f":"IF(ISNA(VLOOKUP(B266,Main!$B$34:$C$39,2,FALSE)),0,VLOOKUP(B266,Main!$B$34:$C$39,2,FALSE))","v":0},{"$f":"1*C266","v":0}]
[null,{"$f":"Products!D164","v":"Touch pure Tree White"},{"$f":"IF(ISNA(VLOOKUP(B267,Main!$B$34:$C$39,2,FALSE)),0,VLOOKUP(B267,Main!$B$34:$C$39,2,FALSE))","v":0},0]
[null,{"$f":"Products!D175","v":"Nano DI Tree"},{"$f":"IF(ISNA(VLOOKUP(B268,Main!$B$34:$C$39,2,FALSE)),0,VLOOKUP(B268,Main!$B$34:$C$39,2,FALSE))","v":0},0]
[null,{"$f":"Products!D178","v":"Touch pure Tree Black"},{"$f":"IF(ISNA(VLOOKUP(B269,Main!$B$34:$C$39,2,FALSE)),0,VLOOKUP(B269,Main!$B$34:$C$39,2,FALSE))","v":0},0]
[null,{"$f":"Products!D182","v":"LED Ceiling Spot Tree RGBW"},{"$f":"IF(ISNA(VLOOKUP(B270,Main!$B$34:$C$39,2,FALSE)),0,VLOOKUP(B270,Main!$B$34:$C$39,2,FALSE))","v":0},0]
[null,{"$f":"Products!D183","v":"LED Ceiling Spot Tree WW"},{"$f":"IF(ISNA(VLOOKUP(B271,Main!$B$34:$C$39,2,FALSE)),0,VLOOKUP(B271,Main!$B$34:$C$39,2,FALSE))","v":0},0]
[null,{"$f":"Products!D184","v":"LED Spot Tree WW"},{"$f":"IF(ISNA(VLOOKUP(B272,Main!$B$34:$C$39,2,FALSE)),0,VLOOKUP(B272,Main!$B$34:$C$39,2,FALSE))","v":0},0]
[null,{"$f":"Products!D185","v":"LED Spot Tree RGBW"},{"$f":"IF(ISNA(VLOOKUP(B273,Main!$B$34:$C$39,2,FALSE)),0,VLOOKUP(B273,Main!$B$34:$C$39,2,FALSE))","v":0},0]
[null,{"$f":"Products!D186","v":"RGBW 24V Dimmer Tree"},{"$f":"IF(ISNA(VLOOKUP(B274,Main!$B$34:$C$39,2,FALSE)),0,VLOOKUP(B274,Main!$B$34:$C$39,2,FALSE))","v":0},0]
[]
[null,null,"Summe",{"$f":"SUM(D261:D275)","v":0}]
[null,null,"Summe mit anderen Kathegorien",null,null,{"$f":"D276+K376+K141+K195+L103","v":0},"sprich mit Kat. Switches"]
[]
[null,"Sonstiges",null,"DO 16A","DO","Modbus"]
[null,"Zubehör","Anzahl"]
["100008",{"$f":"Other!B12","v":"Micro SD Card with firmware"},{"$f":"IF(ISNA(VLOOKUP(B281,Main!$B$92:$C$101,2,FALSE)),0,VLOOKUP(B281,Main!$B$92:$C$101,2,FALSE))","v":0}]
["100011",{"$f":"Other!B50","v":"RS485 Extension"},{"$f":"IF(ISNA(VLOOKUP(B282,Main!$B$92:$C$101,2,FALSE)),0,VLOOKUP(B282,Main!$B$92:$C$101,2,FALSE))","v":0}]
["100013",{"$f":"Other!B51","v":"RS 232 Extension"},{"$f":"IF(ISNA(VLOOKUP(B283,Main!$B$92:$C$101,2,FALSE)),0,VLOOKUP(B283,Main!$B$92:$C$101,2,FALSE))","v":0}]
["100015",{"$f":"Other!B52","v":"not available in this country"},{"$f":"IF(ISNA(VLOOKUP(B284,Main!$B$92:$C$101,2,FALSE)),0,VLOOKUP(B284,Main!$B$92:$C$101,2,FALSE))","v":0}]
["100023",{"$f":"Other!B13","v":"No longer sold"},{"$f":"IF(ISNA(VLOOKUP(B285,Main!$B$92:$C$101,2,FALSE)),0,VLOOKUP(B285,Main!$B$92:$C$101,2,FALSE))","v":0}]
["100025",{"$f":"Other!B14","v":"Weather Service 1 Year"},{"$f":"IF(ISNA(VLOOKUP(B286,Main!$B$92:$C$101,2,FALSE)),0,VLOOKUP(B286,Main!$B$92:$C$101,2,FALSE))","v":0}]
["100026",{"$f":"Other!B15","v":"Weather Service 10 Year"},{"$f":"IF(ISNA(VLOOKUP(B287,Main!$B$92:$C$101,2,FALSE)),0,VLOOKUP(B287,Main!$B$92:$C$101,2,FALSE))","v":0}]
["100027",{"$f":"Other!B16","v":"Caller Service 1 Year"},{"$f":"IF(ISNA(VLOOKUP(B288,Main!$B$92:$C$101,2,FALSE)),0,VLOOKUP(B288,Main!$B$92:$C$101,2,FALSE))","v":0}]
["100028",{"$f":"Other!B17","v":"Caller Service 10 Years"},{"$f":"IF(ISNA(VLOOKUP(B289,Main!$B$92:$C$101,2,FALSE)),0,VLOOKUP(B289,Main!$B$92:$C$101,2,FALSE))","v":0}]
["100035",{"$f":"Other!B18","v":"IR Set"},{"$f":"IF(ISNA(VLOOKUP(B290,Main!$B$92:$C$101,2,FALSE)),0,VLOOKUP(B290,Main!$B$92:$C$101,2,FALSE))","v":0}]
["100124",{"$f":"Other!B53","v":"Modbus Extension"},{"$f":"IF(ISNA(VLOOKUP(B291,Main!$B$92:$C$101,2,FALSE)),0,VLOOKUP(B291,Main!$B$92:$C$101,2,FALSE))","v":0}]
["100178",{"$f":"Other!B19","v":"AquaStar Air 1.5\""},{"$f":"IF(ISNA(VLOOKUP(B292,Main!$B$92:$C$101,2,FALSE)),0,VLOOKUP(B292,Main!$B$92:$C$101,2,FALSE))","v":0}]
["100179",{"$f":"Other!B20","v":"AquaStar Air 2\""},{"$f":"IF(ISNA(VLOOKUP(B293,Main!$B$92:$C$101,2,FALSE)),0,VLOOKUP(B293,Main!$B$92:$C$101,2,FALSE))","v":0}]
["200001",{"$f":"Other!B21","v":"24V Power Supply (1.3A)"},{"$f":"IF(ISNA(VLOOKUP(B294,Main!$B$92:$C$101,2,FALSE)),0,VLOOKUP(B294,Main!$B$92:$C$101,2,FALSE))","v":0}]
["200002",{"$f":"Other!B22","v":"24V Power Supply (4.2A)"},{"$f":"IF(ISNA(VLOOKUP(B295,Main!$B$92:$C$101,2,FALSE)),0,VLOOKUP(B295,Main!$B$92:$C$101,2,FALSE))","v":0},null,null,null,null,null,"Modbus berechnung"]
["200007",{"$f":"Other!B23","v":"not available in this country"},{"$f":"IF(ISNA(VLOOKUP(B296,Main!$B$92:$C$101,2,FALSE)),0,VLOOKUP(B296,Main!$B$92:$C$101,2,FALSE))","v":0},null,null,null,null,null,"benötigt für Geräte",{"$f":"IF(Calculation!F322>0, 1, 0)","v":0}]
["200012",{"$f":"Other!B24","v":"Valve Adaptor VA80"},{"$f":"IF(ISNA(VLOOKUP(B297,Main!$B$92:$C$101,2,FALSE)),0,VLOOKUP(B297,Main!$B$92:$C$101,2,FALSE))","v":0},null,null,null,null,null,"zusätzl. Ausgew.",{"$f":"Calculation!C291","v":0}]
["200013",{"$f":"Other!B25","v":"not available in this country"},{"$f":"IF(ISNA(VLOOKUP(B298,Main!$B$92:$C$101,2,FALSE)),0,VLOOKUP(B298,Main!$B$92:$C$101,2,FALSE))","v":0},null,null,null,null,null,null,{"$f":"SUM(J296:J297)","v":0}]
["200035",{"$f":"Other!B26","v":"24V Power Supply (10A)"},{"$f":"IF(ISNA(VLOOKUP(B299,Main!$B$92:$C$101,2,FALSE)),0,VLOOKUP(B299,Main!$B$92:$C$101,2,FALSE))","v":0}]
["200040",{"$f":"Other!B27","v":"Surface Mount Box - IP20"},{"$f":"IF(ISNA(VLOOKUP(B300,Main!$B$92:$C$101,2,FALSE)),0,VLOOKUP(B300,Main!$B$92:$C$101,2,FALSE))","v":0}]
["200049",{"$f":"Other!B28","v":"Coupling Relay"},{"$f":"IF(ISNA(VLOOKUP(B301,Main!$B$92:$C$101,2,FALSE)),0,VLOOKUP(B301,Main!$B$92:$C$101,2,FALSE))","v":0}]
["200107",{"$f":"Other!B29","v":"not available in this country"},{"$f":"IF(ISNA(VLOOKUP(B302,Main!$B$92:$C$101,2,FALSE)),0,VLOOKUP(B302,Main!$B$92:$C$101,2,FALSE))","v":0}]
["200143",{"$f":"Other!B30","v":"24V Power Supply (0.4A)"},{"$f":"IF(ISNA(VLOOKUP(B303,Main!$B$92:$C$101,2,FALSE)),0,VLOOKUP(B303,Main!$B$92:$C$101,2,FALSE))","v":0}]
["200156",{"$f":"Other!B31","v":"not available in this country"},{"$f":"IF(ISNA(VLOOKUP(B304,Main!$B$92:$C$101,2,FALSE)),0,VLOOKUP(B304,Main!$B$92:$C$101,2,FALSE))","v":0},null,null,{"$f":"C304","v":0}]
["200157",{"$f":"Other!B32","v":"not available in this country"},{"$f":"IF(ISNA(VLOOKUP(B305,Main!$B$92:$C$101,2,FALSE)),0,VLOOKUP(B305,Main!$B$92:$C$101,2,FALSE))","v":0},null,null,0]
[null,{"$f":"Other!B33","v":"Other Load (5A)"},{"$f":"IF(ISNA(VLOOKUP(B306,Main!$B$92:$C$101,2,FALSE)),0,VLOOKUP(B306,Main!$B$92:$C$101,2,FALSE))","v":0},null,{"$f":"C306","v":0}]
[null,{"$f":"Other!B34","v":"Other Load (5-16A)"},{"$f":"IF(ISNA(VLOOKUP(B307,Main!$B$92:$C$101,2,FALSE)),0,VLOOKUP(B307,Main!$B$92:$C$101,2,FALSE))","v":0},{"$f":"C307","v":0}]
["200161",{"$f":"Other!B36","v":"Power Adapter 24V 6.25A"},{"$f":"IF(ISNA(VLOOKUP(B308,Main!$B$92:$C$101,2,FALSE)),0,VLOOKUP(B308,Main!$B$92:$C$101,2,FALSE))","v":0}]
["200207",{"$f":"Other!B35","v":"not available in this country"},{"$f":"IF(ISNA(VLOOKUP(B309,Main!$B$92:$C$101,2,FALSE)),0,VLOOKUP(B309,Main!$B$92:$C$101,2,FALSE))","v":0}]
["200281",{"$f":"Other!B37","v":"NFC Smart Tags"},{"$f":"IF(ISNA(VLOOKUP(B310,Main!$B$92:$C$101,2,FALSE)),0,VLOOKUP(B310,Main!$B$92:$C$101,2,FALSE))","v":0}]
["200294",{"$f":"Other!B38","v":"not available in this country"},{"$f":"IF(ISNA(VLOOKUP(B311,Main!$B$92:$C$101,2,FALSE)),0,VLOOKUP(B311,Main!$B$92:$C$101,2,FALSE))","v":0}]
[null,{"$f":"Other!B39","v":"24V LED Power Supply (2.5A)"},{"$f":"IF(ISNA(VLOOKUP(B312,Main!$B$92:$C$101,2,FALSE)),0,VLOOKUP(B312,Main!$B$92:$C$101,2,FALSE))","v":0}]
[null,{"$f":"Other!B40","v":"Panel wire (328ft) blue/white"},{"$f":"IF(ISNA(VLOOKUP(B313,Main!$B$92:$C$101,2,FALSE)),0,VLOOKUP(B313,Main!$B$92:$C$101,2,FALSE))","v":0}]
[null,{"$f":"Other!B41","v":"Panel wire (328ft) orange/white"},{"$f":"IF(ISNA(VLOOKUP(B314,Main!$B$92:$C$101,2,FALSE)),0,VLOOKUP(B314,Main!$B$92:$C$101,2,FALSE))","v":0}]
[null,{"$f":"Other!B42","v":"Panel wire (328ft) green/white"},{"$f":"IF(ISNA(VLOOKUP(B315,Main!$B$92:$C$101,2,FALSE)),0,VLOOKUP(B315,Main!$B$92:$C$101,2,FALSE))","v":0}]
[null,{"$f":"Other!B43","v":"not available in this country"},{"$f":"IF(ISNA(VLOOKUP(B316,Main!$B$92:$C$101,2,FALSE)),0,VLOOKUP(B316,Main!$B$92:$C$101,2,FALSE))","v":0}]
[null,{"$f":"Other!B44","v":"not available in this country"},{"$f":"IF(ISNA(VLOOKUP(B317,Main!$B$92:$C$101,2,FALSE)),0,VLOOKUP(B317,Main!$B$92:$C$101,2,FALSE))","v":0}]
[null,{"$f":"Other!B45","v":"not available in this country"},{"$f":"IF(ISNA(VLOOKUP(B318,Main!$B$92:$C$101,2,FALSE)),0,VLOOKUP(B318,Main!$B$92:$C$101,2,FALSE))","v":0}]
[null,{"$f":"Other!B46","v":"not available in this country"},{"$f":"IF(ISNA(VLOOKUP(B319,Main!$B$92:$C$101,2,FALSE)),0,VLOOKUP(B319,Main!$B$92:$C$101,2,FALSE))","v":0}]
[null,{"$f":"Other!B47","v":"not available in this country"},{"$f":"IF(ISNA(VLOOKUP(B320,Main!$B$92:$C$101,2,FALSE)),0,VLOOKUP(B320,Main!$B$92:$C$101,2,FALSE))","v":0}]
[null,{"$f":"Other!B48","v":"not available in this country"},{"$f":"IF(ISNA(VLOOKUP(B321,Main!$B$92:$C$101,2,FALSE)),0,VLOOKUP(B321,Main!$B$92:$C$101,2,FALSE))","v":0}]
[null,null,"Summe",{"$f":"D307","v":0},{"$f":"E306","v":0},{"$f":"SUM(F281:F311)","v":0}]
[]
[]
[null,"Fans&Partner","Anzahl"]
["100004",{"$f":"Other!B2","v":"Rollup Banner English"},{"$f":"IF(ISNA(VLOOKUP(B326,Main!$B$103:$C$107,2,FALSE)),0,VLOOKUP(B326,Main!$B$103:$C$107,2,FALSE))","v":0}]
["100170",{"$f":"Other!B3","v":"not available in this country"},{"$f":"IF(ISNA(VLOOKUP(B327,Main!$B$103:$C$107,2,FALSE)),0,VLOOKUP(B327,Main!$B$103:$C$107,2,FALSE))","v":0}]
["200050",{"$f":"Other!B4","v":"Loxone Sticker"},{"$f":"IF(ISNA(VLOOKUP(B328,Main!$B$103:$C$107,2,FALSE)),0,VLOOKUP(B328,Main!$B$103:$C$107,2,FALSE))","v":0}]
["200086",{"$f":"Other!B5","v":"Fanshirt S"},{"$f":"IF(ISNA(VLOOKUP(B329,Main!$B$103:$C$107,2,FALSE)),0,VLOOKUP(B329,Main!$B$103:$C$107,2,FALSE))","v":0}]
["200087",{"$f":"Other!B6","v":"Fanshirt M"},{"$f":"IF(ISNA(VLOOKUP(B330,Main!$B$103:$C$107,2,FALSE)),0,VLOOKUP(B330,Main!$B$103:$C$107,2,FALSE))","v":0}]
["200088",{"$f":"Other!B7","v":"Fanshirt L"},{"$f":"IF(ISNA(VLOOKUP(B331,Main!$B$103:$C$107,2,FALSE)),0,VLOOKUP(B331,Main!$B$103:$C$107,2,FALSE))","v":0}]
["200089",{"$f":"Other!B8","v":"Fanshirt XL"},{"$f":"IF(ISNA(VLOOKUP(B332,Main!$B$103:$C$107,2,FALSE)),0,VLOOKUP(B332,Main!$B$103:$C$107,2,FALSE))","v":0}]
["200090",{"$f":"Other!B9","v":"Fanshirt XXL"},{"$f":"IF(ISNA(VLOOKUP(B333,Main!$B$103:$C$107,2,FALSE)),0,VLOOKUP(B333,Main!$B$103:$C$107,2,FALSE))","v":0}]
["200158",{"$f":"Other!B10","v":"not available in this country"},{"$f":"IF(ISNA(VLOOKUP(B334,Main!$B$103:$C$107,2,FALSE)),0,VLOOKUP(B334,Main!$B$103:$C$107,2,FALSE))","v":0}]
["200186",{"$f":"Other!B11","v":"Loxone Brochure (25 pcs)"},{"$f":"IF(ISNA(VLOOKUP(B335,Main!$B$103:$C$107,2,FALSE)),0,VLOOKUP(B335,Main!$B$103:$C$107,2,FALSE))","v":0}]
[]
[]
[null,"Beschattung","Anzahl","DO","Air Base"]
[100153.0,{"$f":"Shading!B2","v":"Nano IO Air"},{"$f":"IF(ISNA(VLOOKUP(B339,Main!$B$17:$C$19,2,FALSE)),0,VLOOKUP(B339,Main!$B$17:$C$19,2,FALSE))","v":0},null,{"$f":"Products!N37*C339","v":0}]
[null,{"$f":"Shading!B3","v":"Shading (Blinds, Curtains, …)"},{"$f":"IF(ISNA(VLOOKUP(B340,Main!$B$17:$C$19,2,FALSE)),0,VLOOKUP(B340,Main!$B$17:$C$19,2,FALSE))","v":0},{"$f":"2*C340","v":0}]
["100182",{"$f":"Products!D52","v":"not available in this country"},{"$f":"IF(ISNA(VLOOKUP(B341,Main!$B$17:$C$19,2,FALSE)),0,VLOOKUP(B341,Main!$B$17:$C$19,2,FALSE))","v":0},{"$f":"Products!N52*C341","v":0},{"$f":"C341","v":0}]
["100183",{"$f":"Products!D53","v":"not available in this country"},{"$f":"IF(ISNA(VLOOKUP(B342,Main!$B$17:$C$19,2,FALSE)),0,VLOOKUP(B342,Main!$B$17:$C$19,2,FALSE))","v":0},{"$f":"Products!N53*C342","v":0},0]
["100184",{"$f":"Products!D54","v":"not available in this country"},{"$f":"IF(ISNA(VLOOKUP(B343,Main!$B$17:$C$19,2,FALSE)),0,VLOOKUP(B343,Main!$B$17:$C$19,2,FALSE))","v":0},{"$f":"Products!N54*C343","v":0},0]
[null,null,"Summe",{"$f":"SUM(D339:D340)","v":0},{"$f":"SUM(E339:E343)","v":0},null,null,null,"Zusätzlich Benötigt"]
[null,null,null,null,null,null,null,null,"Air Base Extension"]
[null,null,null,null,null,null,null,null,"Extension"]
[null,"Information",null,null,null,null,null,null,"Miniserver"]
[null,"Rollo per Kabel zu NANO IO und Nano zu AirBase per Funk"]
[null,"pro Rollo/Markise/Jalousie/Raffstore 1 Nano"]
[null,"1 Nano belegt 1 Kanal auf AirBase"]
[null,"Nano Air (DI6,DO2, 1W-Ausgang Sensor)"]
[null,"DI für Taster z.B."]
[null,"DO für Jalousie etc."]
[]
[]
[null,"Taster","Anzahl","DI","AI","Airbase","EnOcean",null,null,null,"TREE"]
[null,{"$f":"Switch!B2","v":"Retractive Wattstoper 1 Push button (reserve 1 DI)"},{"$f":"IF(ISNA(VLOOKUP(B357,Main!$B$52:$C$57,2,FALSE)),0,VLOOKUP(B357,Main!$B$52:$C$57,2,FALSE))","v":0},{"$f":"1*C357","v":0}]
[null,{"$f":"Switch!B3","v":"Retractive  Wattstoper 2 Push buttons (reserve 2 DI)"},{"$f":"IF(ISNA(VLOOKUP(B358,Main!$B$52:$C$57,2,FALSE)),0,VLOOKUP(B358,Main!$B$52:$C$57,2,FALSE))","v":0},{"$f":"2*C358","v":0},null,null,null,null,null,null,null,null,"Information"]
[null,{"$f":"Switch!B4","v":"Retractive  Wattstoper 4 Push buttons (reserve 4 DI)"},{"$f":"IF(ISNA(VLOOKUP(B359,Main!$B$52:$C$57,2,FALSE)),0,VLOOKUP(B359,Main!$B$52:$C$57,2,FALSE))","v":0},{"$f":"4*C359","v":0}]
[null,{"$f":"Switch!B5","v":"Retractive  Wattstoper 5 Push buttons (reserve 5 DI)"},{"$f":"IF(ISNA(VLOOKUP(B360,Main!$B$52:$C$57,2,FALSE)),0,VLOOKUP(B360,Main!$B$52:$C$57,2,FALSE))","v":0},{"$f":"5*C360","v":0},null,null,null,null,null,null,null,null,"AI auch bei DI möglich, wenn frei!"]
["100154",{"$f":"Switch!B6","v":"Loxone Touch for Nano White"},{"$f":"IF(ISNA(VLOOKUP(B361,Main!$B$52:$C$57,2,FALSE)),0,VLOOKUP(B361,Main!$B$52:$C$57,2,FALSE))","v":0},null,null,{"$f":"Products!N38*C361","v":0}]
["100155",{"$f":"Switch!B7","v":"Loxone Touch Air White"},{"$f":"IF(ISNA(VLOOKUP(B362,Main!$B$52:$C$57,2,FALSE)),0,VLOOKUP(B362,Main!$B$52:$C$57,2,FALSE))","v":0},null,null,{"$f":"Products!N39*C362","v":0}]
[200057.0,{"$f":"Switch!B8","v":"not available in this country"},{"$f":"IF(ISNA(VLOOKUP(B363,Main!$B$52:$C$57,2,FALSE)),0,VLOOKUP(B363,Main!$B$52:$C$57,2,FALSE))","v":0},null,null,null,{"$f":"Products!N80*C363","v":0}]
["100180",{"$f":"Switch!B9","v":"Loxone Touch Air Anthracite"},{"$f":"IF(ISNA(VLOOKUP(B364,Main!$B$52:$C$57,2,FALSE)),0,VLOOKUP(B364,Main!$B$52:$C$57,2,FALSE))","v":0},null,null,{"$f":"Products!N50*C239","v":0}]
["100181",{"$f":"Switch!B10","v":"Loxone Touch for Nano Anthracite"},{"$f":"IF(ISNA(VLOOKUP(B365,Main!$B$52:$C$57,2,FALSE)),0,VLOOKUP(B365,Main!$B$52:$C$57,2,FALSE))","v":0},null,null,{"$f":"Products!N51*C240","v":0}]
[null,{"$f":"Switch!B11","v":"Touch Tree White"},{"$f":"IF(ISNA(VLOOKUP(B366,Main!$B$52:$C$57,2,FALSE)),0,VLOOKUP(B366,Main!$B$52:$C$57,2,FALSE))","v":0},null,null,null,null,null,null,null,{"$f":"C366*Products!N151","v":0}]
[null,{"$f":"Switch!B14","v":"Touch pure for Nano White"},{"$f":"IF(ISNA(VLOOKUP(B367,Main!$B$52:$C$57,2,FALSE)),0,VLOOKUP(B367,Main!$B$52:$C$57,2,FALSE))","v":0}]
[null,{"$f":"Switch!B15","v":"Touch pure Tree White"},{"$f":"IF(ISNA(VLOOKUP(B368,Main!$B$52:$C$57,2,FALSE)),0,VLOOKUP(B368,Main!$B$52:$C$57,2,FALSE))","v":0},null,null,null,null,null,null,null,{"$f":"1*C368","v":0}]
[null,{"$f":"Switch!B12","v":"Touch Tree Black"},{"$f":"IF(ISNA(VLOOKUP(B369,Main!$B$52:$C$57,2,FALSE)),0,VLOOKUP(B369,Main!$B$52:$C$57,2,FALSE))","v":0},null,null,null,null,null,null,null,{"$f":"C369*Products!N152","v":0}]
[null,{"$f":"Wireless!B26","v":"Touch pure Air White"},{"$f":"IF(ISNA(VLOOKUP(B370,Main!$B$52:$C$57,2,FALSE)),0,VLOOKUP(B370,Main!$B$52:$C$57,2,FALSE))","v":0},null,null,{"$f":"C370","v":0}]
[null,{"$f":"Switch!B16","v":"Touch pure Nano Black"},{"$f":"IF(ISNA(VLOOKUP(B371,Main!$B$52:$C$57,2,FALSE)),0,VLOOKUP(B371,Main!$B$52:$C$57,2,FALSE))","v":0}]
[null,{"$f":"Switch!B17","v":"Touch pure Tree Black"},{"$f":"IF(ISNA(VLOOKUP(B372,Main!$B$52:$C$57,2,FALSE)),0,VLOOKUP(B372,Main!$B$52:$C$57,2,FALSE))","v":0},null,null,null,null,null,null,null,{"$f":"C372","v":0}]
[null,{"$f":"Switch!B18","v":"Touch pure Air Black"},{"$f":"IF(ISNA(VLOOKUP(B373,Main!$B$52:$C$57,2,FALSE)),0,VLOOKUP(B373,Main!$B$52:$C$57,2,FALSE))","v":0},null,null,{"$f":"C373","v":0}]
[null,null,{"$f":"IF(ISNA(VLOOKUP(B374,Main!$B$52:$C$57,2,FALSE)),0,VLOOKUP(B374,Main!$B$52:$C$57,2,FALSE))","v":0}]
[null,null,{"$f":"IF(ISNA(VLOOKUP(B375,Main!$B$52:$C$57,2,FALSE)),0,VLOOKUP(B375,Main!$B$52:$C$57,2,FALSE))","v":0}]
[null,null,"Summe",{"$f":"SUM(D357:D375)","v":0},0,0,{"$f":"SUM(G357:G363)","v":0},null,null,null,{"$f":"SUM(K357:K375)","v":0}]
[]
[]
[null,"Ms & Extensions","Anzahl","AI (Eingang)","DI (Eingang)","AO (Ausgang)","DO (Ausgang)","1-Wire Kanal","Air Base Kanal","EnOcean","Tree","DO 16A","DMX Kanäle","DMX Air Dimmer","Dali"]
["100001",{"$f":"'Ms&Extensions'!B2","v":"Miniserver"},{"$f":"IF(ISNA(VLOOKUP(B380,Main!$B$76:$C$79,2,FALSE)),0,VLOOKUP(B380,Main!$B$76:$C$79,2,FALSE))","v":0},{"$f":"Products!$J$7*C380","v":0},{"$f":"Products!$K$7*C380","v":0},{"$f":"Products!$L$7*C380","v":0},{"$f":"Products!$M$7*C380","v":0}]
["100002",{"$f":"'Ms&Extensions'!B3","v":"Extension"},{"$f":"IF(ISNA(VLOOKUP(B381,Main!$B$76:$C$79,2,FALSE)),0,VLOOKUP(B381,Main!$B$76:$C$79,2,FALSE))","v":0},{"$f":"Products!$J$8*C381","v":0},{"$f":"Products!$K$8*C381","v":0},{"$f":"Products!$L$8*C381","v":0},{"$f":"Products!$M$8*C381","v":0}]
["100011",{"$f":"'Ms&Extensions'!B4","v":"RS485 Extension"},{"$f":"IF(ISNA(VLOOKUP(B382,Main!$B$76:$C$79,2,FALSE)),0,VLOOKUP(B382,Main!$B$76:$C$79,2,FALSE))","v":0}]
["100012",{"$f":"'Ms&Extensions'!B5","v":"DMX Extension"},{"$f":"IF(ISNA(VLOOKUP(B383,Main!$B$76:$C$79,2,FALSE)),0,VLOOKUP(B383,Main!$B$76:$C$79,2,FALSE))","v":0},null,null,null,null,null,null,null,null,null,{"$f":"Products!$N$12*C383","v":0}]
["100013",{"$f":"'Ms&Extensions'!B6","v":"RS 232 Extension"},{"$f":"IF(ISNA(VLOOKUP(B384,Main!$B$76:$C$79,2,FALSE)),0,VLOOKUP(B384,Main!$B$76:$C$79,2,FALSE))","v":0}]
["100014",{"$f":"'Ms&Extensions'!B7","v":"1-Wire Extension"},{"$f":"IF(ISNA(VLOOKUP(B385,Main!$B$76:$C$79,2,FALSE)),0,VLOOKUP(B385,Main!$B$76:$C$79,2,FALSE))","v":0},null,null,null,null,{"$f":"Products!$N$14*C385","v":0}]
["100015",{"$f":"'Ms&Extensions'!B8","v":"not available in this country"},{"$f":"IF(ISNA(VLOOKUP(B386,Main!$B$76:$C$79,2,FALSE)),0,VLOOKUP(B386,Main!$B$76:$C$79,2,FALSE))","v":0},null,null,null,null,null,null,{"$f":"Products!$N$15*C386","v":0}]
[100124.0,{"$f":"Products!D28","v":"Modbus Extension"},{"$f":"IF(ISNA(VLOOKUP(B387,Main!$B$76:$C$79,2,FALSE)),0,VLOOKUP(B387,Main!$B$76:$C$79,2,FALSE))","v":0}]
["100029",{"$f":"'Ms&Extensions'!B10","v":"Dimmer Extension"},{"$f":"IF(ISNA(VLOOKUP(B388,Main!$B$76:$C$79,2,FALSE)),0,VLOOKUP(B388,Main!$B$76:$C$79,2,FALSE))","v":0},null,{"$f":"Products!$K$21*C388","v":0},{"$f":"Products!$L$21*C388","v":0}]
["100038",{"$f":"'Ms&Extensions'!B11","v":"Relay Extension"},{"$f":"IF(ISNA(VLOOKUP(B389,Main!$B$76:$C$79,2,FALSE)),0,VLOOKUP(B389,Main!$B$76:$C$79,2,FALSE))","v":0},null,null,null,null,null,null,null,null,{"$f":"Products!$M$23*C389","v":0}]
["100114",{"$f":"'Ms&Extensions'!B12","v":"Air Base Extension"},{"$f":"IF(ISNA(VLOOKUP(B390,Main!$B$76:$C$79,2,FALSE)),0,VLOOKUP(B390,Main!$B$76:$C$79,2,FALSE))","v":0},null,null,null,null,null,{"$f":"Products!$N$24*C390","v":0}]
["100116",{"$f":"'Ms&Extensions'!B13","v":"Multi Extension Air"},{"$f":"IF(ISNA(VLOOKUP(B391,Main!$B$76:$C$79,2,FALSE)),0,VLOOKUP(B391,Main!$B$76:$C$79,2,FALSE))","v":0},null,{"$f":"Products!$K$26*C391","v":0},null,null,{"$f":"Products!$N$26*C391","v":0},null,null,null,{"$f":"Products!$M$26*C391","v":0},null,{"$f":"C391","v":0}]
["100139",{"$f":"'Ms&Extensions'!B14","v":"Miniserver Go"},{"$f":"IF(ISNA(VLOOKUP(B392,Main!$B$76:$C$79,2,FALSE)),0,VLOOKUP(B392,Main!$B$76:$C$79,2,FALSE))","v":0},null,null,null,null,null,{"$f":"Products!$N$30*C392","v":0}]
["100158",{"$f":"'Ms&Extensions'!B15","v":"not available in this country"},{"$f":"IF(ISNA(VLOOKUP(B393,Main!$B$76:$C$79,2,FALSE)),0,VLOOKUP(B393,Main!$B$76:$C$79,2,FALSE))","v":0}]
[null,{"$f":"Products!D150","v":"Tree Extension"},{"$f":"IF(ISNA(VLOOKUP(B394,Main!$B$76:$C$79,2,FALSE)),0,VLOOKUP(B394,Main!$B$76:$C$79,2,FALSE))","v":0},null,null,null,null,null,null,null,1.0]
[null,"Dali Extension",{"$f":"IF(ISNA(VLOOKUP(B395,Main!$B$76:$C$79,2,FALSE)),0,VLOOKUP(B395,Main!$B$76:$C$79,2,FALSE))","v":0}]
[null,"Internorm Extension",{"$f":"IF(ISNA(VLOOKUP(B396,Main!$B$76:$C$79,2,FALSE)),0,VLOOKUP(B396,Main!$B$76:$C$79,2,FALSE))","v":0}]
[null,"Netzteilrechner","Anzahl","Ampere/Stk","Gesamt"]
["100001",{"$f":"'Ms&Extensions'!B2","v":"Miniserver"},{"$f":"Products!B7","v":0},{"$f":"0.12","v":0.12},{"$f":"C398*D398","v":0}]
["100002",{"$f":"'Ms&Extensions'!B3","v":"Extension"},{"$f":"Products!B8","v":0},{"$f":"0.06","v":0.06},0,null,null,null,null,"Summe Netzteile"]
["100011",{"$f":"'Ms&Extensions'!B4","v":"RS485 Extension"},{"$f":"Products!B11","v":0},0.03,0,null,"1,3A Netzteil",{"$f":"IF((E414-H401*4.2)<4.2,ROUNDUP((E414-H401*4.2)/1.3,0),0)","v":0},null,"0,4A Netzteil",null,{"$f":"H416","v":0}]
["100012",{"$f":"'Ms&Extensions'!B5","v":"DMX Extension"},{"$f":"Products!B12","v":0},0.03,0,null,"4,2A Netzteil",{"$f":"ROUNDDOWN(E414/4.2,0)","v":0},null,"1,3A Netzteil",null,{"$f":"H400+H439","v":0}]
["100013",{"$f":"'Ms&Extensions'!B6","v":"RS 232 Extension"},{"$f":"Products!B13","v":0},{"$f":"0.03","v":0.03},0,null,null,null,null,"4,2A Netzteil",null,{"$f":"H401+H419+H440","v":0}]
["100014",{"$f":"'Ms&Extensions'!B7","v":"1-Wire Extension"},{"$f":"Products!B14","v":0},0.03,0,null,null,null,null,"10A Netzteil",null,{"$f":"H420+H441","v":0}]
["100015",{"$f":"'Ms&Extensions'!B8","v":"not available in this country"},{"$f":"Products!B15","v":0},0.03,0]
["100029",{"$f":"'Ms&Extensions'!B10","v":"Dimmer Extension"},{"$f":"Products!B21","v":0},0.06,0]
["100035",{"$f":"Products!D22","v":"IR Set"},{"$f":"Products!B22","v":0},0.03,0,null,null,null,"Extensions"]
["100038",{"$f":"'Ms&Extensions'!B11","v":"Relay Extension"},{"$f":"Products!B23","v":0},{"$f":"0.3","v":0.3},0,null,null,null,"Verfügbar",{"$f":"H400*1.3+H401*4.2","v":0}]
["100114",{"$f":"'Ms&Extensions'!B12","v":"Air Base Extension"},{"$f":"Products!B24","v":0},0.006,0,null,null,null,"Benötigt",{"$f":"E414","v":0}]
["100124",{"$f":"Products!D28","v":"Modbus Extension"},{"$f":"Products!B28","v":0},0.03,0]
["100158",{"$f":"'Ms&Extensions'!B15","v":"not available in this country"},{"$f":"Products!B40","v":0},0.03,0]
[null,{"$f":"Products!D150","v":"Tree Extension"},{"$f":"Products!B150","v":0},{"$f":"Products!O150","v":0.0048},0]
[null,{"$f":"Products!D160","v":"Dali Extension"},{"$f":"Products!B160","v":0},0.1,0]
[]
[null,null,null,"Summe",{"$f":"SUM(E398:E413)","v":0}]
[]
["100116",{"$f":"'Ms&Extensions'!B13","v":"Multi Extension Air"},{"$f":"Products!B26","v":0},"0,4 A Netzt. Pro Ext.",null,null,"0,4A Netzteil",{"$f":"C416","v":0}]
[]
["200042",{"$f":"Products!D73","v":"RGB LED Strip 5m"},{"$f":"Products!B73","v":0},{"$f":"14.4*5/24","v":3},{"$f":"C418*D418","v":0}]
["200043",{"$f":"Products!D74","v":"Warm White LED Strip 5m"},{"$f":"Products!B74","v":0},3,0,null,"4,2A Netzteil",{"$f":"IF((E435-H420*10)<10,ROUNDUP((E435-H420*10)/4.2,0),0)","v":0}]
["200045","RGB Streifen IP 65 - gelöscht",null,null,null,null,"10A Netzteil",{"$f":"ROUNDDOWN(E435/10,0)","v":0}]
["200046",{"$f":"Products!D75","v":"RGB LED Strip 5m IP68"},{"$f":"Products!B75","v":0},{"$f":"14.4*5/24","v":3},{"$f":"C421*D421","v":0}]
["200061",{"$f":"Products!D82","v":"Warm White LED Strip 5m IP65"},{"$f":"Products!B82","v":0},3,0,null,null,null,"LED"]
["200092",{"$f":"Products!D93","v":"Warm White LED Strip 5m IP68"},{"$f":"Products!B93","v":0},3,0,null,null,null,"Verfügbar",{"$f":"H419*4.2+H420*10","v":0}]
["200098",{"$f":"Products!D98","v":"RGBW LED Strip 5m IP20"},{"$f":"Products!B98","v":0},3.6,0,null,null,null,"Benötigt",{"$f":"E435","v":0}]
["200099",{"$f":"Products!D99","v":"RGBW LED Strip 5m IP65"},{"$f":"Products!B99","v":0},3.6,0]
["200100",{"$f":"Products!D100","v":"RGBW LED Strip 5m IP68"},{"$f":"Products!B100","v":0},3.6,0]
[100204.0,{"$f":"Products!D147","v":"LED Spot RGBW"},{"$f":"Products!B147","v":0},0.2,0]
[100203.0,{"$f":"Products!D148","v":"LED Spot Warm White"},{"$f":"Products!B148","v":0},0.2,0]
[null,{"$f":"Light!B23","v":"LED Ceiling Spot RGBW"},{"$f":"Products!B180","v":0},0.392,0]
[null,{"$f":"Light!B24","v":"LED Ceiling Spot WW"},{"$f":"Products!B181","v":0},0.392,0]
[null,{"$f":"Light!B25","v":"LED Ceiling Spot Tree RGBW"},{"$f":"Products!B182","v":0},0.392,0]
[null,{"$f":"Light!B26","v":"LED Ceiling Spot Tree WW"},{"$f":"Products!B183","v":0},0.392,0]
[null,{"$f":"Light!B27","v":"LED Spot Tree WW"},{"$f":"Products!B184","v":0},0.23,0]
[null,{"$f":"Light!B28","v":"LED Spot Tree RGBW"},{"$f":"Products!B185","v":0},0.23,0]
[null,null,null,"Summe",{"$f":"SUM(E418:E434)","v":0}]
[]
["200003",{"$f":"Products!D57","v":"Outside Temperature Sensor 0-10V"},{"$f":"Products!B57","v":0},0.005,{"$f":"C437*D437","v":0}]
["200004",{"$f":"Products!D58","v":"No longer sold"},{"$f":"Products!B58","v":0},0.042,0]
["200006",{"$f":"Products!D60","v":"Indoor Temperature Sensor 0-10V"},{"$f":"Products!B60","v":0},0.005,0,null,"1,3A Netzteil",{"$f":"IF(E458>(H441*10+H440*4.2),ROUNDUP((E458-H441*10-H440*4.2)/1.3,0),0)","v":0}]
["200010",{"$f":"Products!D62","v":"Indoor Temperature & Humidity Sensor 0-10V"},{"$f":"Products!B62","v":0},0.005,0,null,"4,2A Netzteil",{"$f":"IF((E458-H441*10)<1.3,0,IF((E458>H441*10),ROUNDUP((E458-H441*10)/4.2,0),0))","v":0}]
["200017",{"$f":"Products!D65","v":"Indoor Temperature, Humidty & CO2 Sensor 0-10V"},{"$f":"Products!B65","v":0},0.01,0,null,"10A Netzteil",{"$f":"ROUNDDOWN(E458/10,0)","v":0}]
["200018",{"$f":"Products!D66","v":"Rain Sensor (24V)"},{"$f":"Products!B66","v":0},{"$f":"0.06","v":0.06},0]
["200031",{"$f":"Products!D67","v":"Outdoor Temperature & Humidy Sensor 0-10V"},{"$f":"Products!B67","v":0},0.005,0]
["200032",{"$f":"Products!D68","v":"Brightness Sensor 0-10V"},{"$f":"Products!B68","v":0},{"$f":"0.005","v":0.005},0,null,null,null,"Pheriperie"]
[null,null,null,null,null,null,null,null,"Verfügbar",{"$f":"H439*1.3+H440*4.2+H441*10","v":0}]
["200054",{"$f":"Products!D79","v":"Ultrasonic Sensor 0-10V"},{"$f":"Products!B79","v":0},0.06,{"$f":"C446*D446","v":0},null,null,null,"Benötigt",{"$f":"E458","v":0}]
["200112",{"$f":"Products!D105","v":"Outside Motion Sensor (24V)"},{"$f":"Products!B105","v":0},0.015,0]
[200136.0,{"$f":"Products!D109","v":"Temperature & Humidity Sensor For Saunas"},{"$f":"Products!B109","v":0},0.005,0]
["200154",{"$f":"Products!D115","v":"Pressure Sensor 0-10V"},{"$f":"Products!B115","v":0},0.01,0]
[null,{"$f":"Products!D151","v":"Touch Tree White"},{"$f":"Products!B151","v":0},{"$f":"Products!O151","v":0.0048},0]
[null,{"$f":"Products!D152","v":"Touch Tree Black"},{"$f":"Products!B152","v":0},{"$f":"Products!O152","v":0.0048},0]
[null,{"$f":"Products!D153","v":"Motion Sensor Tree White"},{"$f":"Products!B153","v":0},{"$f":"Products!O153","v":0.0048},0]
[null,{"$f":"Products!D162","v":"Touch pure Air White"},{"$f":"Products!B162","v":0},0.0]
[null,{"$f":"Products!D163","v":"Touch pure for Nano White"},{"$f":"Products!B163","v":0},0.0]
[null,{"$f":"Products!D164","v":"Touch pure Tree White"},{"$f":"Products!B164","v":0}]
[null,{"$f":"Products!D154","v":"Valve Actuator Tree"},{"$f":"Products!B154","v":0},0.05,{"$f":"IF(C456/100>1,ROUNDUP(C456/100,0)*1,IF(C456>0,D456*5,0))","v":0}]
[]
[null,null,null,"Summe",{"$f":"SUM(E437:E456)","v":0}]
[]
[]
[]
[]
[]
[null,"Platzbedarfsrechner","Anzahl","Platz","Gesamt"]
["100001",{"$f":"'Ms&Extensions'!B2","v":"Miniserver"},{"$f":"C398","v":0},155.0,{"$f":"C465*D465","v":0}]
["100002",{"$f":"'Ms&Extensions'!B3","v":"Extension"},0,155.0,0]
["100011",{"$f":"'Ms&Extensions'!B4","v":"RS485 Extension"},0,34.0,0]
["100012",{"$f":"'Ms&Extensions'!B5","v":"DMX Extension"},0,34.0,0,null,"Gesamt in mm",{"$f":"E495","v":0}]
["100013",{"$f":"'Ms&Extensions'!B6","v":"RS 232 Extension"},0,34.0,0,null,"Teilungseinh.",{"$f":"ROUNDUP(H468/17.2,0)","v":0}]
["100014",{"$f":"'Ms&Extensions'!B7","v":"1-Wire Extension"},0,34.0,0]
["100015",{"$f":"'Ms&Extensions'!B8","v":"not available in this country"},0,34.0,0]
["100029",{"$f":"'Ms&Extensions'!B10","v":"Dimmer Extension"},0,155.0,0]
["100035",{"$f":"Products!D22","v":"IR Set"},0,34.0,0]
["100038",{"$f":"'Ms&Extensions'!B11","v":"Relay Extension"},0,155.0,0]
["100114",{"$f":"'Ms&Extensions'!B12","v":"Air Base Extension"},0,34.0,0]
["100124",{"$f":"Products!D28","v":"Modbus Extension"},0,34.0,0]
["100158",{"$f":"'Ms&Extensions'!B15","v":"not available in this country"},0,35.0,0]
["200049",{"$f":"Products!D77","v":"Coupling Relay"},{"$f":"Products!B77","v":0},17.0,0]
["100117",{"$f":"Products!D27","v":"RGBW 24V Dimmer DMX"},{"$f":"Products!B27","v":0},34.0,0]
["200001",{"$f":"Products!D55","v":"24V Power Supply (1.3A)"},{"$f":"Products!B55","v":0},53.0,0]
["200002",{"$f":"Products!D56","v":"24V Power Supply (4.2A)"},{"$f":"Products!B56","v":0},90.0,0]
["200035",{"$f":"Products!D71","v":"24V Power Supply (10A)"},{"$f":"Products!B71","v":0},83.0,0]
["200143",{"$f":"Products!D111","v":"24V Power Supply (0.4A)"},{"$f":"Products!B111","v":0},18.0,0]
["200156",{"$f":"Products!D117","v":"not available in this country"},{"$f":"Products!B117","v":0},17.5,0]
["200157",{"$f":"Products!D118","v":"not available in this country"},{"$f":"Products!B118","v":0},70.0,0]
["200168",{"$f":"Products!D120","v":"Push In Terminal Block 8x4 Interconnected (20 pcs)"},{"$f":"Products!B120","v":0},120.0,0]
["200169",{"$f":"Products!D121","v":"Push In Terminal Block 8x4 Seperated (20pcs)"},{"$f":"Products!B121","v":0},120.0,0]
["200173",{"$f":"Products!D125","v":"Push In Terminal Block 3+Earth (50 pcs)"},{"$f":"Products!B125","v":0},104.0,0]
["200175",{"$f":"Products!D127","v":"Push In Terminal Block Twin+Earth (50 pcs)"},{"$f":"Products!B127","v":0},100.0,0]
["200178",{"$f":"Products!D130","v":"Push in Fused Terminal Block (25 pcs)"},{"$f":"Products!B130","v":0},70.0,0]
[null,{"$f":"Products!D150","v":"Tree Extension"},{"$f":"Products!B150","v":0},34.0,0]
[null,{"$f":"Products!D160","v":"Dali Extension"},{"$f":"Products!B160","v":0},34.0,0]
[null,{"$f":"Products!D186","v":"RGBW 24V Dimmer Tree"},{"$f":"Products!B186","v":0},34.0,0]
[]
[null,"Gesamt",null,null,{"$f":"SUM(E465:E493)","v":0}]
[null,"Dali Berechnung","Anzahl Channel",null,0.0,null,"zusätzliche Extension ?"]
[null,{"$f":"Light!B21","v":"Dali Channel"},{"$f":"IF(ISNA(VLOOKUP(B497,Main!$B$5:$C$14,2,FALSE)),0,VLOOKUP(B497,Main!$B$2:$C$14,2,FALSE))","v":0},null,0.0]
[null,null,null,null,0.0]
[null,null,null,null,1.0]
[null,null,null,null,0.0]
[null,null,null,null,0.0]
[null,"DMX Berechnung","Anzahl Geräte",null,"Summe dimmbar","AIR","nach Projekttyp entscheiden"]
[null,"LED Streifen IP20",{"$f":"Products!B98","v":0},null,0.0]
[null,"LED IP 65",{"$f":"Products!B99","v":0},null,0.0]
[null,"LED IP 68",{"$f":"Products!B100","v":0},null,1.0]
[null,"Spot WW",{"$f":"Products!B148","v":0},null,0.0]
[null,"Spot RGBW",{"$f":"Products!B147","v":0}]
[null,"LED WW IP65",{"$f":"Products!B82","v":0}]
[null,"LED RGB ip20",{"$f":"Products!B73","v":0}]
[null,"LED RGB IP68",{"$f":"Products!B75","v":0}]
[null,"DMX Dimmer",{"$f":"Products!B27","v":0},null,"DMX Extension Berechnung"]
[null,"Air Dimmer",{"$f":"Products!B29","v":0},null,{"$f":"ROUNDUP(C511/32,0)","v":0}]

{"sheet":"Power","index":14,"n_rows":76,"n_cols":25,"rows_kept":76,"cut":false,"hidden":false,"merged":[[2,1,3,5],[8,1,8,5],[30,1,30,5],[50,1,50,5]]}
[]
[]
[null,{"$f":"VLOOKUP(Main!C2,Translating_general!A29:P46,2,FALSE)","v":"Power Supply Calculator"}]
[]
[]
[null,{"$f":"VLOOKUP(Main!C2,Translating_general!A29:P46,3,FALSE)","v":"Power Supplies"},"0,4 A","1,3 A","4,2 A","10 A"]
[null,null,{"$f":"W12","v":""},{"$f":"W13","v":0},{"$f":"W14","v":0},{"$f":"W15","v":0}]
[]
[null,{"$f":"VLOOKUP(Main!C2,Translating_general!A29:P46,4,FALSE)","v":"Extensions"},null,null,null,null,null,null,null,null,null,null,null,null,null,null,null,null,null,null,null,null,null,{"$f":"VLOOKUP(Main!C2,Translating_general!A29:P46,4,FALSE)","v":"Extensions"}]
[null,{"$f":"VLOOKUP(Main!C2,Translating_general!A29:P46,5,FALSE)","v":"Item number"},{"$f":"VLOOKUP(Main!C2,Translating_general!A29:P46,6,FALSE)","v":"Products"},{"$f":"VLOOKUP(Main!C2,Translating_general!A29:P46,7,FALSE)","v":"Quantity"},{"$f":"VLOOKUP(Main!C2,Translating_general!A29:P46,8,FALSE)","v":"Ampere/item"},{"$f":"VLOOKUP(Main!C2,Translating_general!A29:P46,9,FALSE)","v":"Total"},null,null,null,null,null,null,null,null,null,null,null,null,null,null,null,null,null,{"$f":"VLOOKUP(Main!C2,Translating_general!A29:P46,10,FALSE)","v":"Ampere available"},{"$f":"W19*1.3+W20*4.2","v":0}]
[null,"100001",{"$f":"Calculation!B398","v":"Miniserver"},{"$f":"Products!B7","v":0},{"$f":"Calculation!D398","v":0.12},{"$f":"D11*E11","v":0},null,null,null,null,null,null,null,null,null,null,null,null,null,null,null,"Gesamt",null,{"$f":"VLOOKUP(Main!C2,Translating_general!A29:P46,11,FALSE)","v":"Ampere needed"},{"$f":"F26","v":0}]
[null,"100002",{"$f":"Calculation!B399","v":"Extension"},{"$f":"Products!B8","v":0},{"$f":"Calculation!D399","v":0.06},0,null,null,null,null,null,null,null,null,null,null,null,null,null,null,null,"0,4A Netzteil",{"$f":"D28","v":""}]
[null,"100011",{"$f":"Calculation!B400","v":"RS485 Extension"},{"$f":"Products!B11","v":0},{"$f":"Calculation!D400","v":0.03},0,null,null,null,null,null,null,null,null,null,null,null,null,null,null,null,"1,3A Netzteil",{"$f":"W19+W55","v":0}]
[null,"100012",{"$f":"Calculation!B401","v":"DMX Extension"},{"$f":"Products!B12","v":0},{"$f":"Calculation!D401","v":0.03},0,null,null,null,null,null,null,null,null,null,null,null,null,null,null,null,"4,2A Netzteil",{"$f":"W20+W34+W56","v":0}]
[null,"100013",{"$f":"Calculation!B402","v":"RS 232 Extension"},{"$f":"Products!B13","v":0},{"$f":"Calculation!D402","v":0.03},0,null,null,null,null,null,null,null,null,null,null,null,null,null,null,null,"10A Netzteil",{"$f":"W35+W57","v":0}]
[null,"100014",{"$f":"Calculation!B403","v":"1-Wire Extension"},{"$f":"Products!B14","v":0},{"$f":"Calculation!D403","v":0.03},0]
[null,"100015",{"$f":"Calculation!B404","v":"not available in this country"},{"$f":"Products!B15","v":0},{"$f":"Calculation!D404","v":0.03},0]
[null,"100029",{"$f":"Calculation!B405","v":"Dimmer Extension"},{"$f":"Products!B21","v":0},{"$f":"Calculation!D405","v":0.06},0]
[null,"100035",{"$f":"Calculation!B406","v":"IR Set"},{"$f":"Products!B22","v":0},{"$f":"Calculation!D406","v":0.03},0,null,null,null,null,null,null,null,null,null,null,null,null,null,null,null,"1,3A Netzteil",{"$f":"IF((F26-W20*4.2)<4.2,ROUNDUP((F26-W20*4.2)/1.3,0),0)","v":0}]
[null,"100038",{"$f":"Calculation!B407","v":"Relay Extension"},{"$f":"Products!B23","v":0},{"$f":"Calculation!D407","v":0.3},0,null,null,null,null,null,null,null,null,null,null,null,null,null,null,null,"4,2A Netzteil",{"$f":"ROUNDDOWN(F26/4.2,0)","v":0}]
[null,"100114",{"$f":"Calculation!B408","v":"Air Base Extension"},{"$f":"Products!B24","v":0},{"$f":"Calculation!D408","v":0.006},0]
[null,"100124",{"$f":"Calculation!B409","v":"Modbus Extension"},{"$f":"Products!B28","v":0},{"$f":"Calculation!D409","v":0.03},0]
[null,"100158",{"$f":"Calculation!B410","v":"not available in this country"},{"$f":"Products!B40","v":0},{"$f":"Calculation!D410","v":0.03},0]
[null,{"$f":"Products!C150","v":100218},{"$f":"Calculation!B411","v":"Tree Extension"},{"$f":"Products!B150","v":0},{"$f":"Products!O150","v":0.0048},0]
[null,{"$f":"Products!C160","v":100200},{"$f":"Products!D160","v":"Dali Extension"},{"$f":"Products!B160","v":0},0.134,0]
[null,null,null,null,{"$f":"VLOOKUP(Main!C2,Translating_general!A29:P46,12,FALSE)","v":"Total"},{"$f":"SUM(F11:O25)","v":0}]
[]
[null,"100116",{"$f":"Calculation!B416","v":"Multi Extension Air"},null,{"$f":"VLOOKUP(Main!C2,Translating_general!A29:P46,15,FALSE)","v":"0,4 Ampere Power Supply / item"},null,null,null,null,null,null,null,null,null,null,null,null,null,null,null,null,"0,4A Netzteil",{"$f":"D28","v":""}]
[]
[]
[null,{"$f":"VLOOKUP(Main!C2,Translating_general!A29:P46,13,FALSE)","v":"LED"},null,null,null,null,null,null,null,null,null,null,null,null,null,null,null,null,null,null,null,null,null,{"$f":"VLOOKUP(Main!C2,Translating_general!A29:P46,13,FALSE)","v":"LED"}]
[null,{"$f":"VLOOKUP(Main!C2,Translating_general!A29:P46,5,FALSE)","v":"Item number"},{"$f":"VLOOKUP(Main!C2,Translating_general!A29:P46,6,FALSE)","v":"Products"},{"$f":"VLOOKUP(Main!C2,Translating_general!A29:P46,7,FALSE)","v":"Quantity"},{"$f":"VLOOKUP(Main!C2,Translating_general!A29:P46,8,FALSE)","v":"Ampere/item"},{"$f":"VLOOKUP(Main!C2,Translating_general!A29:P46,9,FALSE)","v":"Total"},null,null,null,null,null,null,null,null,null,null,null,null,null,null,null,null,null,{"$f":"VLOOKUP(Main!C2,Translating_general!A29:P46,10,FALSE)","v":"Ampere available"},{"$f":"W34*4.2+W35*10","v":0}]
[null,"200042",{"$f":"Calculation!B418","v":"RGB LED Strip 5m"},{"$f":"Products!B73","v":0},{"$f":"Calculation!D418","v":3},{"$f":"D33*E33","v":0},null,null,null,null,null,null,null,null,null,null,null,null,null,null,null,null,null,{"$f":"VLOOKUP(Main!C2,Translating_general!A29:P46,11,FALSE)","v":"Ampere needed"},{"$f":"F49","v":0}]
[null,"200043",{"$f":"Calculation!B419","v":"Warm White LED Strip 5m"},{"$f":"Products!B74","v":0},{"$f":"Calculation!D419","v":3},0,null,null,null,null,null,null,null,null,null,null,null,null,null,null,null,"4,2A Netzteil",{"$f":"IF((F49-W35*10)<10,ROUNDUP((F49-W35*10)/4.2,0),0)","v":0}]
[null,"200046",{"$f":"Calculation!B421","v":"RGB LED Strip 5m IP68"},{"$f":"Products!B75","v":0},{"$f":"Calculation!D421","v":3},0,null,null,null,null,null,null,null,null,null,null,null,null,null,null,null,"10A Netzteil",{"$f":"ROUNDDOWN(F49/10,0)","v":0}]
[null,"200061",{"$f":"Calculation!B422","v":"Warm White LED Strip 5m IP65"},{"$f":"Products!B82","v":0},{"$f":"Calculation!D422","v":3},0]
[null,"200092",{"$f":"Calculation!B423","v":"Warm White LED Strip 5m IP68"},{"$f":"Products!B93","v":0},{"$f":"Calculation!D423","v":3},0]
[null,"200098",{"$f":"Calculation!B424","v":"RGBW LED Strip 5m IP20"},{"$f":"Products!B98","v":0},{"$f":"Calculation!D424","v":3.6},0]
[null,"200099",{"$f":"Calculation!B425","v":"RGBW LED Strip 5m IP65"},{"$f":"Products!B99","v":0},{"$f":"Calculation!D425","v":3.6},0]
[null,"200100",{"$f":"Calculation!B426","v":"RGBW LED Strip 5m IP68"},{"$f":"Products!B100","v":0},{"$f":"Calculation!D426","v":3.6},0]
[null,100204.0,{"$f":"Calculation!B427","v":"LED Spot RGBW"},{"$f":"Products!B147","v":0},{"$f":"Calculation!D427","v":0.2},0]
[null,100203.0,{"$f":"Calculation!B428","v":"LED Spot Warm White"},{"$f":"Products!B148","v":0},{"$f":"Calculation!D428","v":0.2},0]
[null,{"$f":"Products!C180","v":100235},{"$f":"Light!B23","v":"LED Ceiling Spot RGBW"},{"$f":"Products!B180","v":0},{"$f":"Calculation!D429","v":0.392},0]
[null,{"$f":"Products!C181","v":100236},{"$f":"Light!B24","v":"LED Ceiling Spot WW"},{"$f":"Products!B181","v":0},{"$f":"Calculation!D430","v":0.392},0]
[null,{"$f":"Products!C182","v":100237},{"$f":"Light!B25","v":"LED Ceiling Spot Tree RGBW"},{"$f":"Products!B182","v":0},{"$f":"Calculation!D431","v":0.392},0]
[null,{"$f":"Products!C183","v":100238},{"$f":"Light!B26","v":"LED Ceiling Spot Tree WW"},{"$f":"Products!B183","v":0},{"$f":"Calculation!D432","v":0.392},0]
[null,{"$f":"Products!C184","v":100268},{"$f":"Light!B27","v":"LED Spot Tree WW"},{"$f":"Products!B184","v":0},{"$f":"Calculation!D433","v":0.23},0]
[null,{"$f":"Products!C185","v":100269},{"$f":"Light!B28","v":"LED Spot Tree RGBW"},{"$f":"Products!B185","v":0},{"$f":"Calculation!D434","v":0.23},0]
[null,null,null,null,{"$f":"VLOOKUP(Main!C2,Translating_general!A29:P46,12,FALSE)","v":"Total"},{"$f":"SUM(F33:F48)","v":0}]
[]
[null,{"$f":"VLOOKUP(Main!C2,Translating_general!A29:P46,14,FALSE)","v":"Periphery"},null,null,null,null,null,null,null,null,null,null,null,null,null,null,null,null,null,null,null,null,null,{"$f":"VLOOKUP(Main!C2,Translating_general!A29:P46,14,FALSE)","v":"Periphery"}]
[null,{"$f":"VLOOKUP(Main!C2,Translating_general!A29:P46,5,FALSE)","v":"Item number"},{"$f":"VLOOKUP(Main!C2,Translating_general!A29:P46,6,FALSE)","v":"Products"},{"$f":"VLOOKUP(Main!C2,Translating_general!A29:P46,7,FALSE)","v":"Quantity"},{"$f":"VLOOKUP(Main!C2,Translating_general!A29:P46,8,FALSE)","v":"Ampere/item"},{"$f":"VLOOKUP(Main!C2,Translating_general!A29:P46,9,FALSE)","v":"Total"},null,null,null,null,null,null,null,null,null,null,null,null,null,null,null,null,null,{"$f":"VLOOKUP(Main!C2,Translating_general!A29:P46,10,FALSE)","v":"Ampere available"},{"$f":"W55*1.3+W56*4.2+W57*10","v":0}]
[null,"200003",{"$f":"Calculation!B437","v":"Outside Temperature Sensor 0-10V"},{"$f":"Products!B57","v":0},{"$f":"Calculation!D437","v":0.005},{"$f":"D53*E53","v":0},null,null,null,null,null,null,null,null,null,null,null,null,null,null,null,null,null,{"$f":"VLOOKUP(Main!C2,Translating_general!A29:P46,11,FALSE)","v":"Ampere needed"},{"$f":"F73","v":0}]
[null,"200004",{"$f":"Calculation!B438","v":"No longer sold"},{"$f":"Products!B58","v":0},{"$f":"Calculation!D438","v":0.042},0]
[null,"200006",{"$f":"Calculation!B439","v":"Indoor Temperature Sensor 0-10V"},{"$f":"Products!B60","v":0},{"$f":"Calculation!D439","v":0.005},0,null,null,null,null,null,null,null,null,null,null,null,null,null,null,null,"1,3A Netzteil",{"$f":"IF(F73>(W57*10+W56*4.2),ROUNDUP((F73-W57*10-W56*4.2)/1.3,0),0)","v":0}]
[null,"200010",{"$f":"Calculation!B440","v":"Indoor Temperature & Humidity Sensor 0-10V"},{"$f":"Products!B62","v":0},{"$f":"Calculation!D440","v":0.005},0,null,null,null,null,null,null,null,null,null,null,null,null,null,null,null,"4,2A Netzteil",{"$f":"IF((F73-W57*10)<1.3,0,IF((F73>W57*10),ROUNDUP((F73-W57*10)/4.2,0),0))","v":0}]
[null,"200017",{"$f":"Calculation!B441","v":"Indoor Temperature, Humidty & CO2 Sensor 0-10V"},{"$f":"Products!B65","v":0},{"$f":"Calculation!D441","v":0.01},0,null,null,null,null,null,null,null,null,null,null,null,null,null,null,null,"10A Netzteil",{"$f":"ROUNDDOWN(F73/10,0)","v":0}]
[null,"200018",{"$f":"Calculation!B442","v":"Rain Sensor (24V)"},{"$f":"Products!B66","v":0},{"$f":"Calculation!D442","v":0.06},0]
[null,"200031",{"$f":"Calculation!B443","v":"Outdoor Temperature & Humidy Sensor 0-10V"},{"$f":"Products!B67","v":0},{"$f":"Calculation!D443","v":0.005},0]
[null,"200032",{"$f":"Calculation!B444","v":"Brightness Sensor 0-10V"},{"$f":"Products!B68","v":0},{"$f":"Calculation!D444","v":0.005},0]
[null,"200054",{"$f":"Calculation!B446","v":"Ultrasonic Sensor 0-10V"},{"$f":"Products!B79","v":0},{"$f":"Calculation!D446","v":0.06},0]
[null,"200112",{"$f":"Calculation!B447","v":"Outside Motion Sensor (24V)"},{"$f":"Products!B105","v":0},{"$f":"Calculation!D447","v":0.015},0]
[null,200136.0,{"$f":"Calculation!B448","v":"Temperature & Humidity Sensor For Saunas"},{"$f":"Products!B109","v":0},{"$f":"Calculation!D448","v":0.005},0]
[null,"200154",{"$f":"Calculation!B449","v":"Pressure Sensor 0-10V"},{"$f":"Products!B115","v":0},{"$f":"Calculation!D449","v":0.01},0]
[null,100221.0,{"$f":"Calculation!B450","v":"Touch Tree White"},{"$f":"Products!B151","v":0},{"$f":"Products!O151","v":0.0048},0]
[null,100222.0,{"$f":"Calculation!B451","v":"Touch Tree Black"},{"$f":"Products!B152","v":0},{"$f":"Products!O152","v":0.0048},0]
[null,100223.0,{"$f":"Calculation!B452","v":"Motion Sensor Tree White"},{"$f":"Products!B153","v":0},{"$f":"Products!O153","v":0.0048},0]
[null,{"$f":"Products!C164","v":100219},{"$f":"Calculation!B455","v":"Touch pure Tree White"},{"$f":"Products!B164","v":0},0.0048,0]
[null,{"$f":"Products!C154","v":100225},{"$f":"Products!D154","v":"Valve Actuator Tree"},{"$f":"Products!B154","v":0},0.05,{"$f":"Calculation!E456","v":0}]
[null,{"$f":"Products!C178","v":100220},{"$f":"Products!D178","v":"Touch pure Tree Black"},{"$f":"Products!B178","v":0},0.0048,{"$f":"D70*E70","v":0}]
[]
[]
[null,null,null,null,{"$f":"VLOOKUP(Main!C2,Translating_general!A29:P46,12,FALSE)","v":"Total"},{"$f":"SUM(F53:F70)","v":0}]
[]
[null,"Please note that the power calculation assumes you have everything centrally in one cabinet!"]
[null,"You have to double check it for your project."]

{"sheet":"Sample Quote","index":15,"n_rows":0,"n_cols":0,"rows_kept":0,"cut":false,"hidden":true,"merged":[]}

{"sheet":"Project information","index":16,"n_rows":194,"n_cols":51,"rows_kept":194,"cut":false,"hidden":true,"merged":[]}
[null,null,null,null,null,null,null,null,null,null,null,null,"Cathegory/Rooms",{"$f":"Main!D3","v":""},{"$f":"Main!E3","v":""},{"$f":"Main!F3","v":""},{"$f":"Main!G3","v":""},{"$f":"Main!H3","v":""},{"$f":"Main!I3","v":""},{"$f":"Main!J3","v":""},{"$f":"Main!K3","v":""},{"$f":"Main!L3","v":""},{"$f":"Main!M3","v":""},{"$f":"Main!N3","v":""},{"$f":"Main!O3","v":""},{"$f":"Main!P3","v":""},{"$f":"Main!Q3","v":""},{"$f":"Main!R3","v":""},{"$f":"Main!S3","v":""},{"$f":"Main!T3","v":""},{"$f":"Main!U3","v":""},{"$f":"Main!V3","v":""},{"$f":"Main!W3","v":""},{"$f":"Main!X3","v":""},{"$f":"Main!Y3","v":""},{"$f":"Main!Z3","v":""},{"$f":"Main!AA3","v":""},{"$f":"Main!AB3","v":""},{"$f":"Main!AC3","v":""},{"$f":"Main!AD3","v":""},{"$f":"Main!AE3","v":""},{"$f":"Main!AF3","v":""},{"$f":"Main!AG3","v":""},{"$f":"Main!AH3","v":""},{"$f":"Main!AI3","v":""},{"$f":"Main!AJ3","v":""},{"$f":"Main!AK3","v":""},{"$f":"Main!AL3","v":""},{"$f":"Main!AM3","v":""},{"$f":"Main!AN3","v":""},{"$f":"Main!AO3","v":""}]
[null,null,null,null,null,null,null,null,null,null,null,null,"Lighting"]
[null,null,null,null,null,null,null,null,null,null,null,null,"Heating"]
[null,null,null,null,null,null,null,null,null,null,null,null,"Shading"]
[null,null,null,null,null,null,null,null,null,null,null,null,"Music"]
[null,null,null,null,null,null,null,null,null,null,null,null,"Access"]
[]
[]
[]
[]
[]
[]
[]
[null,null,null,null,null,null,null,null,null,null,null,null,{"$f":"Products!D7","v":"Miniserver"}]
[null,null,null,null,null,null,null,null,null,null,null,null,{"$f":"Products!D8","v":"Extension"}]
[null,null,null,null,null,null,null,null,null,null,null,null,{"$f":"Products!D9","v":"Rollup Banner English"}]
[null,null,null,null,null,null,null,null,null,null,null,null,{"$f":"Products!D10","v":"Micro SD Card with firmware"}]
[null,null,null,null,null,null,null,null,null,null,null,null,{"$f":"Products!D11","v":"RS485 Extension"}]
[null,null,null,null,null,null,null,null,null,null,null,null,{"$f":"Products!D12","v":"DMX Extension"}]
[null,null,null,null,null,null,null,null,null,null,null,null,{"$f":"Products!D13","v":"RS 232 Extension"}]
[null,null,null,null,null,null,null,null,null,null,null,null,{"$f":"Products!D14","v":"1-Wire Extension"}]
[null,null,null,null,null,null,null,null,null,null,null,null,{"$f":"Products!D15","v":"not available in this country"}]
[null,null,null,null,null,null,null,null,null,null,null,null,{"$f":"Products!D16","v":"No longer sold"}]
[null,null,null,null,null,null,null,null,null,null,null,null,{"$f":"Products!D17","v":"Weather Service 1 Year"}]
[null,null,null,null,null,null,null,null,null,null,null,null,{"$f":"Products!D18","v":"Weather Service 10 Year"}]
[null,null,null,null,null,null,null,null,null,null,null,null,{"$f":"Products!D19","v":"Caller Service 1 Year"}]
[null,null,null,null,null,null,null,null,null,null,null,null,{"$f":"Products!D20","v":"Caller Service 10 Years"}]
[null,null,null,null,null,null,null,null,null,null,null,null,{"$f":"Products!D21","v":"Dimmer Extension"}]
[null,null,null,null,null,null,null,null,null,null,null,null,{"$f":"Products!D22","v":"IR Set"}]
[null,null,null,null,null,null,null,null,null,null,null,null,{"$f":"Products!D23","v":"Relay Extension"}]
[null,null,null,null,null,null,null,null,null,null,null,null,{"$f":"Products!D24","v":"Air Base Extension"}]
[null,null,null,null,null,null,null,null,null,null,null,null,{"$f":"Products!D25","v":"not available in this country"}]
[null,null,null,null,null,null,null,null,null,null,null,null,{"$f":"Products!D26","v":"Multi Extension Air"}]
[null,null,null,null,null,null,null,null,null,null,null,null,{"$f":"Products!D27","v":"RGBW 24V Dimmer DMX"}]
[null,null,null,null,null,null,null,null,null,null,null,null,{"$f":"Products!D28","v":"Modbus Extension"}]
[null,null,null,null,null,null,null,null,null,null,null,null,{"$f":"Products!D29","v":"RGBW 24V Dimmer Air"}]
[null,null,null,null,null,null,null,null,null,null,null,null,{"$f":"Products!D30","v":"Miniserver Go"}]
[null,null,null,null,null,null,null,null,null,null,null,null,{"$f":"Products!D31","v":"Remote Air"}]
[null,null,null,null,null,null,null,null,null,null,null,null,{"$f":"Products!D32","v":"IR Control Air"}]
[null,null,null,null,null,null,null,null,null,null,null,null,{"$f":"Products!D33","v":"Smoke Detector Air"}]
[null,null,null,null,null,null,null,null,null,null,null,null,{"$f":"Products!D34","v":"Temperature & Humidity Sesnor Air"}]
[null,null,null,null,null,null,null,null,null,null,null,null,{"$f":"Products!D35","v":"Loxone Tool Kit by Weidmüller"}]
[null,null,null,null,null,null,null,null,null,null,null,null,{"$f":"Products!D36","v":"not available in this country"}]
[null,null,null,null,null,null,null,null,null,null,null,null,{"$f":"Products!D37","v":"Nano IO Air"}]
[null,null,null,null,null,null,null,null,null,null,null,null,{"$f":"Products!D38","v":"Loxone Touch for Nano White"}]
[null,null,null,null,null,null,null,null,null,null,null,null,{"$f":"Products!D39","v":"Loxone Touch Air White"}]
[null,null,null,null,null,null,null,null,null,null,null,null,{"$f":"Products!D40","v":"not available in this country"}]
[null,null,null,null,null,null,null,null,null,null,null,null,{"$f":"Products!D41","v":"Valve Actuator Air"}]
[null,null,null,null,null,null,null,null,null,null,null,null,{"$f":"Products!D42","v":"Loxone Music Server 4 Zone"}]
[null,null,null,null,null,null,null,null,null,null,null,null,{"$f":"Products!D43","v":"Loxone Music Server 8 Zone"}]
[null,null,null,null,null,null,null,null,null,null,null,null,{"$f":"Products!D44","v":"Loxone Music Server 12 Zone"}]
[null,null,null,null,null,null,null,null,null,null,null,null,{"$f":"Products!D45","v":"Loxone Music Server 16 Zone"}]
[null,null,null,null,null,null,null,null,null,null,null,null,{"$f":"Products!D46","v":"Loxone Music Server 20 Zone"}]
[null,null,null,null,null,null,null,null,null,null,null,null,{"$f":"Products!D47","v":"not available in this country"}]
[null,null,null,null,null,null,null,null,null,null,null,null,{"$f":"Products!D48","v":"AquaStar Air 1.5\""}]
[null,null,null,null,null,null,null,null,null,null,null,null,{"$f":"Products!D49","v":"AquaStar Air 2\""}]
[null,null,null,null,null,null,null,null,null,null,null,null,{"$f":"Products!D50","v":"Loxone Touch Air Anthracite"}]
[null,null,null,null,null,null,null,null,null,null,null,null,{"$f":"Products!D51","v":"Loxone Touch for Nano Anthracite"}]
[null,null,null,null,null,null,null,null,null,null,null,null,{"$f":"Products!D52","v":"not available in this country"}]
[null,null,null,null,null,null,null,null,null,null,null,null,{"$f":"Products!D53","v":"not available in this country"}]
[null,null,null,null,null,null,null,null,null,null,null,null,{"$f":"Products!D54","v":"not available in this country"}]
[null,null,null,null,null,null,null,null,null,null,null,null,{"$f":"Products!D55","v":"24V Power Supply (1.3A)"}]
[null,null,null,null,null,null,null,null,null,null,null,null,{"$f":"Products!D56","v":"24V Power Supply (4.2A)"}]
[null,null,null,null,null,null,null,null,null,null,null,null,{"$f":"Products!D57","v":"Outside Temperature Sensor 0-10V"}]
[null,null,null,null,null,null,null,null,null,null,null,null,{"$f":"Products!D58","v":"No longer sold"}]
[null,null,null,null,null,null,null,null,null,null,null,null,{"$f":"Products!D59","v":"No longer sold"}]
[null,null,null,null,null,null,null,null,null,null,null,null,{"$f":"Products!D60","v":"Indoor Temperature Sensor 0-10V"}]
[null,null,null,null,null,null,null,null,null,null,null,null,{"$f":"Products!D61","v":"not available in this country"}]
[null,null,null,null,null,null,null,null,null,null,null,null,{"$f":"Products!D62","v":"Indoor Temperature & Humidity Sensor 0-10V"}]
[null,null,null,null,null,null,null,null,null,null,null,null,{"$f":"Products!D63","v":"Valve Adaptor VA80"}]
[null,null,null,null,null,null,null,null,null,null,null,null,{"$f":"Products!D64","v":"not available in this country"}]
[null,null,null,null,null,null,null,null,null,null,null,null,{"$f":"Products!D65","v":"Indoor Temperature, Humidty & CO2 Sensor 0-10V"}]
[null,null,null,null,null,null,null,null,null,null,null,null,{"$f":"Products!D66","v":"Rain Sensor (24V)"}]
[null,null,null,null,null,null,null,null,null,null,null,null,{"$f":"Products!D67","v":"Outdoor Temperature & Humidy Sensor 0-10V"}]
[null,null,null,null,null,null,null,null,null,null,null,null,{"$f":"Products!D68","v":"Brightness Sensor 0-10V"}]
[null,null,null,null,null,null,null,null,null,null,null,null,{"$f":"Products!D69","v":"Wind Sensor (24V)"}]
[null,null,null,null,null,null,null,null,null,null,null,null,{"$f":"Products!D70","v":"Wind Sensor Mount"}]
[null,null,null,null,null,null,null,null,null,null,null,null,{"$f":"Products!D71","v":"24V Power Supply (10A)"}]
[null,null,null,null,null,null,null,null,null,null,null,null,{"$f":"Products!D72","v":"Surface Mount Box - IP20"}]
[null,null,null,null,null,null,null,null,null,null,null,null,{"$f":"Products!D73","v":"RGB LED Strip 5m"}]
[null,null,null,null,null,null,null,null,null,null,null,null,{"$f":"Products!D74","v":"Warm White LED Strip 5m"}]
[null,null,null,null,null,null,null,null,null,null,null,null,{"$f":"Products!D75","v":"RGB LED Strip 5m IP68"}]
[null,null,null,null,null,null,null,null,null,null,null,null,{"$f":"Products!D76","v":"SMA Antenna 868 MHz"}]
[null,null,null,null,null,null,null,null,null,null,null,null,{"$f":"Products!D77","v":"Coupling Relay"}]
[null,null,null,null,null,null,null,null,null,null,null,null,{"$f":"Products!D78","v":"Loxone Sticker"}]
[null,null,null,null,null,null,null,null,null,null,null,null,{"$f":"Products!D79","v":"Ultrasonic Sensor 0-10V"}]
[null,null,null,null,null,null,null,null,null,null,null,null,{"$f":"Products!D80","v":"not available in this country"}]
[null,null,null,null,null,null,null,null,null,null,null,null,{"$f":"Products!D81","v":"not available in this country"}]
[null,null,null,null,null,null,null,null,null,null,null,null,{"$f":"Products!D82","v":"Warm White LED Strip 5m IP65"}]
[null,null,null,null,null,null,null,null,null,null,null,null,{"$f":"Products!D83","v":"iButton Reader 1-Wire"}]
[null,null,null,null,null,null,null,null,null,null,null,null,{"$f":"Products!D84","v":"iButton Electronic Key Fob"}]
[null,null,null,null,null,null,null,null,null,null,null,null,{"$f":"Products!D85","v":"not available in this country"}]
[null,null,null,null,null,null,null,null,null,null,null,null,{"$f":"Products!D86","v":"not available in this country"}]
[null,null,null,null,null,null,null,null,null,null,null,null,{"$f":"Products!D87","v":"Temperature Probe 1-Wire"}]
[null,null,null,null,null,null,null,null,null,null,null,null,{"$f":"Products!D88","v":"Fanshirt S"}]
[null,null,null,null,null,null,null,null,null,null,null,null,{"$f":"Products!D89","v":"Fanshirt M"}]
[null,null,null,null,null,null,null,null,null,null,null,null,{"$f":"Products!D90","v":"Fanshirt L"}]
[null,null,null,null,null,null,null,null,null,null,null,null,{"$f":"Products!D91","v":"Fanshirt XL"}]
[null,null,null,null,null,null,null,null,null,null,null,null,{"$f":"Products!D92","v":"Fanshirt XXL"}]
[null,null,null,null,null,null,null,null,null,null,null,null,{"$f":"Products!D93","v":"Warm White LED Strip 5m IP68"}]
[null,null,null,null,null,null,null,null,null,null,null,null,{"$f":"Products!D94","v":"Loxone Intercom"}]
[null,null,null,null,null,null,null,null,null,null,null,null,{"$f":"Products!D95","v":"Flush-mounted box for the Loxone intercom"}]
[null,null,null,null,null,null,null,null,null,null,null,null,{"$f":"Products!D96","v":"Surface Box for Loxone Intercom"}]
[null,null,null,null,null,null,null,null,null,null,null,null,{"$f":"Products!D97","v":"Loxone Speaker"}]
[null,null,null,null,null,null,null,null,null,null,null,null,{"$f":"Products!D98","v":"RGBW LED Strip 5m IP20"}]
[null,null,null,null,null,null,null,null,null,null,null,null,{"$f":"Products!D99","v":"RGBW LED Strip 5m IP65"}]
[null,null,null,null,null,null,null,null,null,null,null,null,{"$f":"Products!D100","v":"RGBW LED Strip 5m IP68"}]
[null,null,null,null,null,null,null,null,null,null,null,null,{"$f":"Products!D101","v":"Water Sensor"}]
[null,null,null,null,null,null,null,null,null,null,null,null,{"$f":"Products!D102","v":"not available in this country"}]
[null,null,null,null,null,null,null,null,null,null,null,null,{"$f":"Products!D103","v":"Temperature Sensor Set 1-Wire"}]
[null,null,null,null,null,null,null,null,null,null,null,null,{"$f":"Products!D104","v":"Loxone 12 Channel Amplifier"}]
[null,null,null,null,null,null,null,null,null,null,null,null,{"$f":"Products!D105","v":"Outside Motion Sensor (24V)"}]
[null,null,null,null,null,null,null,null,null,null,null,null,{"$f":"Products!D106","v":"Window & Door Contact"}]
[null,null,null,null,null,null,null,null,null,null,null,null,{"$f":"Products!D107","v":"Loxone Cat 7 Cable (820ft)"}]
[null,null,null,null,null,null,null,null,null,null,null,null,{"$f":"Products!D108","v":"not available in this country"}]
[null,null,null,null,null,null,null,null,null,null,null,null,{"$f":"Products!D109","v":"Temperature & Humidity Sensor For Saunas"}]
[null,null,null,null,null,null,null,null,null,null,null,null,{"$f":"Products!D110","v":"not available in this country"}]
[null,null,null,null,null,null,null,null,null,null,null,null,{"$f":"Products!D111","v":"24V Power Supply (0.4A)"}]
[null,null,null,null,null,null,null,null,null,null,null,null,{"$f":"Products!D112","v":"Loxone Speaker Back Box"}]
[null,null,null,null,null,null,null,null,null,null,null,null,{"$f":"Products!D113","v":"SMA Antenna 4dBi 868 MHz"}]
[null,null,null,null,null,null,null,null,null,null,null,null,{"$f":"Products!D114","v":"Loxone Wall Speaker"}]
[null,null,null,null,null,null,null,null,null,null,null,null,{"$f":"Products!D115","v":"Pressure Sensor 0-10V"}]
[null,null,null,null,null,null,null,null,null,null,null,null,{"$f":"Products!D116","v":"Glass Break Sensor 24V"}]
[null,null,null,null,null,null,null,null,null,null,null,null,{"$f":"Products!D117","v":"not available in this country"}]
[null,null,null,null,null,null,null,null,null,null,null,null,{"$f":"Products!D118","v":"not available in this country"}]
[null,null,null,null,null,null,null,null,null,null,null,null,{"$f":"Products!D119","v":"not available in this country"}]
[null,null,null,null,null,null,null,null,null,null,null,null,{"$f":"Products!D120","v":"Push In Terminal Block 8x4 Interconnected (20 pcs)"}]
[null,null,null,null,null,null,null,null,null,null,null,null,{"$f":"Products!D121","v":"Push In Terminal Block 8x4 Seperated (20pcs)"}]
[null,null,null,null,null,null,null,null,null,null,null,null,{"$f":"Products!D122","v":"Partition for 8x4 Terminals (10pcs)"}]
[null,null,null,null,null,null,null,null,null,null,null,null,{"$f":"Products!D123","v":"Label Holder 8 Levels (20 pcs)"}]
[null,null,null,null,null,null,null,null,null,null,null,null,{"$f":"Products!D124","v":"End Plate for 8x4 Terminals (10 pcs)"}]
[null,null,null,null,null,null,null,null,null,null,null,null,{"$f":"Products!D125","v":"Push In Terminal Block 3+Earth (50 pcs)"}]
[null,null,null,null,null,null,null,null,null,null,null,null,{"$f":"Products!D126","v":"End Plate for 3+Earth Terminals (20 pcs)"}]
[null,null,null,null,null,null,null,null,null,null,null,null,{"$f":"Products!D127","v":"Push In Terminal Block Twin+Earth (50 pcs)"}]
[null,null,null,null,null,null,null,null,null,null,null,null,{"$f":"Products!D128","v":"End Plate for Twin+Earth Terminals (20 pcs)"}]
[null,null,null,null,null,null,null,null,null,null,null,null,{"$f":"Products!D129","v":"End Bracket (20 pcs)"}]
[null,null,null,null,null,null,null,null,null,null,null,null,{"$f":"Products!D130","v":"Push in Fused Terminal Block (25 pcs)"}]
[null,null,null,null,null,null,null,null,null,null,null,null,{"$f":"Products!D131","v":"End Plate For Fused Terminals (50 pcs)"}]
[null,null,null,null,null,null,null,null,null,null,null,null,{"$f":"Products!D132","v":"Cross Connector For Fused Terminals (10 pcs)"}]
[null,null,null,null,null,null,null,null,null,null,null,null,{"$f":"Products!D133","v":"Blade Fuse 2A (100 pcs)"}]
[null,null,null,null,null,null,null,null,null,null,null,null,{"$f":"Products!D134","v":"Blade Fuse 5A (100 pcs)"}]
[null,null,null,null,null,null,null,null,null,null,null,null,{"$f":"Products!D135","v":"Blade Fuse 10A (100 pcs)"}]
[null,null,null,null,null,null,null,null,null,null,null,null,{"$f":"Products!D136","v":"Loxone Brochure (25 pcs)"}]
[null,null,null,null,null,null,null,null,null,null,null,null,{"$f":"Products!D137","v":"iButton Reader 1-Wire Outdoor"}]
[null,null,null,null,null,null,null,null,null,null,null,null,{"$f":"Products!D138","v":"not available in this country"}]
[null,null,null,null,null,null,null,null,null,null,null,null,{"$f":"Products!D139","v":"Loxone Speaker Back Box For Suspended Ceilings"}]
[null,null,null,null,null,null,null,null,null,null,null,null,{"$f":"Products!D140","v":"LED Strip Accessories Set - RGBW"}]
[null,null,null,null,null,null,null,null,null,null,null,null,{"$f":"Products!D141","v":"LED Strip Accessories Set - Warm White"}]
[null,null,null,null,null,null,null,null,null,null,null,null,{"$f":"Products!D142","v":"Power Adapter 24V 6.25A"}]
[null,null,null,null,null,null,null,null,null,null,null,null,{"$f":"Products!D143","v":"Loxone Music Server Upgrade"}]
[null,null,null,null,null,null,null,null,null,null,null,null,{"$f":"Products!D144","v":"Loxone Intercom XL"}]
[null,null,null,null,null,null,null,null,null,null,null,null,{"$f":"Products!D145","v":"Motion Sensor Air"}]
[null,null,null,null,null,null,null,null,null,null,null,null,{"$f":"Products!D146","v":"NFC Smart Tags"}]
[null,null,null,null,null,null,null,null,null,null,null,null,{"$f":"Products!D147","v":"LED Spot RGBW"}]
[null,null,null,null,null,null,null,null,null,null,null,null,{"$f":"Products!D148","v":"LED Spot Warm White"}]
[null,null,null,null,null,null,null,null,null,null,null,null,{"$f":"Products!D149","v":"not available in this country"}]
[null,null,null,null,null,null,null,null,null,null,null,null,{"$f":"Products!D150","v":"Tree Extension"}]
[null,null,null,null,null,null,null,null,null,null,null,null,{"$f":"Products!D151","v":"Touch Tree White"}]
[null,null,null,null,null,null,null,null,null,null,null,null,{"$f":"Products!D152","v":"Touch Tree Black"}]
[null,null,null,null,null,null,null,null,null,null,null,null,{"$f":"Products!D153","v":"Motion Sensor Tree White"}]
[null,null,null,null,null,null,null,null,null,null,null,null,{"$f":"Products!D154","v":"Valve Actuator Tree"}]
[null,null,null,null,null,null,null,null,null,null,null,null,{"$f":"Products!D155","v":"Water Sensor Air"}]
[null,null,null,null,null,null,null,null,null,null,null,null,{"$f":"Products!D156","v":"Door & Window Contact Air Black"}]
[null,null,null,null,null,null,null,null,null,null,null,null,{"$f":"Products!D157","v":"Door & Window Contact Air White"}]
[null,null,null,null,null,null,null,null,null,null,null,null,{"$f":"Products!D158","v":"Motion Sensor Tree Black"}]
[null,null,null,null,null,null,null,null,null,null,null,null,{"$f":"Products!D159","v":"Cross Connector for Mains Terminals (20 pcs)"}]
[null,null,null,null,null,null,null,null,null,null,null,null,{"$f":"Products!D160","v":"Dali Extension"}]
[null,null,null,null,null,null,null,null,null,null,null,null,{"$f":"Products!D161","v":"24V LED Power Supply (2.5A)"}]
[null,null,null,null,null,null,null,null,null,null,null,null,{"$f":"Products!D162","v":"Touch pure Air White"}]
[null,null,null,null,null,null,null,null,null,null,null,null,{"$f":"Products!D163","v":"Touch pure for Nano White"}]
[null,null,null,null,null,null,null,null,null,null,null,null,{"$f":"Products!D164","v":"Touch pure Tree White"}]
[null,null,null,null,null,null,null,null,null,null,null,null,{"$f":"Products!D165","v":"not available in this country"}]
[null,null,null,null,null,null,null,null,null,null,null,null,{"$f":"Products!D166","v":"not available in this country"}]
[null,null,null,null,null,null,null,null,null,null,null,null,{"$f":"Products!D167","v":"Panel wire (328ft) blue/white"}]
[null,null,null,null,null,null,null,null,null,null,null,null,{"$f":"Products!D168","v":"Panel wire (328ft) orange/white"}]
[null,null,null,null,null,null,null,null,null,null,null,null,{"$f":"Products!D169","v":"Panel wire (328ft) green/white"}]
[null,null,null,null,null,null,null,null,null,null,null,null,{"$f":"Products!D170","v":"not available in this country"}]
[null,null,null,null,null,null,null,null,null,null,null,null,{"$f":"Products!D171","v":"not available in this country"}]
[null,null,null,null,null,null,null,null,null,null,null,null,{"$f":"Products!D172","v":"not available in this country"}]
[null,null,null,null,null,null,null,null,null,null,null,null,{"$f":"Products!D173","v":"not available in this country"}]
[null,null,null,null,null,null,null,null,null,null,null,null,{"$f":"Products!D174","v":"not available in this country"}]
[null,null,null,null,null,null,null,null,null,null,null,null,{"$f":"Products!D175","v":"Nano DI Tree"}]
[null,null,null,null,null,null,null,null,null,null,null,null,{"$f":"Products!D176","v":"not available in this country"}]
[null,null,null,null,null,null,null,null,null,null,null,null,{"$f":"Products!D177","v":"Touch pure Nano Black"}]
[null,null,null,null,null,null,null,null,null,null,null,null,{"$f":"Products!D178","v":"Touch pure Tree Black"}]
[null,null,null,null,null,null,null,null,null,null,null,null,{"$f":"Products!D179","v":"Touch pure Air Black"}]
[null,null,null,null,null,null,null,null,null,null,null,null,{"$f":"Products!D180","v":"LED Ceiling Spot RGBW"}]
[null,null,null,null,null,null,null,null,null,null,null,null,{"$f":"Products!D181","v":"LED Ceiling Spot WW"}]
[null,null,null,null,null,null,null,null,null,null,null,null,{"$f":"Products!D182","v":"LED Ceiling Spot Tree RGBW"}]
[null,null,null,null,null,null,null,null,null,null,null,null,{"$f":"Products!D183","v":"LED Ceiling Spot Tree WW"}]
[null,null,null,null,null,null,null,null,null,null,null,null,{"$f":"Products!D184","v":"LED Spot Tree WW"}]
[null,null,null,null,null,null,null,null,null,null,null,null,{"$f":"Products!D185","v":"LED Spot Tree RGBW"}]
[null,null,null,null,null,null,null,null,null,null,null,null,{"$f":"Products!D186","v":"RGBW 24V Dimmer Tree"}]
[null,null,null,null,null,null,null,null,null,null,null,null,{"$f":"Products!D187","v":"Window Handle Air"}]

{"sheet":"Space","index":17,"n_rows":35,"n_cols":9,"rows_kept":35,"cut":false,"hidden":false,"merged":[[7,7,7,8],[2,1,3,5]]}
[]
[]
[null,{"$f":"VLOOKUP(Main!C2,Translating_general!A53:P70,2,FALSE)","v":"Required Space Calculator"}]
[]
[]
[null,{"$f":"VLOOKUP(Main!C2,Translating_general!A53:P70,3,FALSE)","v":"Item Numer"},{"$f":"VLOOKUP(Main!C2,Translating_general!A53:P70,4,FALSE)","v":"Products"},{"$f":"VLOOKUP(Main!C2,Translating_general!A53:P70,5,FALSE)","v":"Quantity"},{"$f":"VLOOKUP(Main!C2,Translating_general!A53:P70,6,FALSE)","v":"Required Space"},{"$f":"VLOOKUP(Main!C2,Translating_general!A53:P70,7,FALSE)","v":"Total"}]
[null,"100001",{"$f":"Calculation!B465","v":"Miniserver"},{"$f":"Products!B7","v":0},{"$f":"Calculation!D465","v":155},{"$f":"D7*E7","v":0}]
[null,"100002",{"$f":"Calculation!B466","v":"Extension"},{"$f":"Products!B8","v":0},{"$f":"Calculation!D466","v":155},0,null,{"$f":"VLOOKUP(Main!C2,Translating_general!A53:P70,8,FALSE)","v":"Total Space"}]
[null,"100011",{"$f":"Calculation!B467","v":"RS485 Extension"},{"$f":"Products!B11","v":0},{"$f":"Calculation!D467","v":34},0,null,{"$f":"VLOOKUP(Main!C2,Translating_general!A53:P70,9,FALSE)","v":"Required Space in mm"},{"$f":"SUM(F7:F35)","v":0}]
[null,"100012",{"$f":"Calculation!B468","v":"DMX Extension"},{"$f":"Products!B12","v":0},{"$f":"Calculation!D468","v":34},0,null,{"$f":"VLOOKUP(Main!C2,Translating_general!A53:P70,10,FALSE)","v":"Required Space in splitting units"},{"$f":"ROUNDUP(I9/17.2,0)","v":0}]
[null,"100013",{"$f":"Calculation!B469","v":"RS 232 Extension"},{"$f":"Products!B13","v":0},{"$f":"Calculation!D469","v":34},0]
[null,"100014",{"$f":"Calculation!B470","v":"1-Wire Extension"},{"$f":"Products!B14","v":0},{"$f":"Calculation!D470","v":34},0]
[null,"100015",{"$f":"Calculation!B471","v":"not available in this country"},{"$f":"Products!B15","v":0},{"$f":"Calculation!D471","v":34},0]
[null,"100029",{"$f":"Calculation!B472","v":"Dimmer Extension"},{"$f":"Products!B21","v":0},{"$f":"Calculation!D472","v":155},0]
[null,"100035",{"$f":"Calculation!B473","v":"IR Set"},{"$f":"Products!B22","v":0},{"$f":"Calculation!D473","v":34},0]
[null,"100038",{"$f":"Calculation!B474","v":"Relay Extension"},{"$f":"Products!B23","v":0},{"$f":"Calculation!D474","v":155},0]
[null,"100114",{"$f":"Calculation!B475","v":"Air Base Extension"},{"$f":"Products!B24","v":0},{"$f":"Calculation!D475","v":34},0]
[null,"100124",{"$f":"Calculation!B476","v":"Modbus Extension"},{"$f":"Products!B28","v":0},{"$f":"Calculation!D476","v":34},0]
[null,"100158",{"$f":"Calculation!B477","v":"not available in this country"},{"$f":"Products!B40","v":0},{"$f":"Calculation!D477","v":35},0]
[null,"200049",{"$f":"Calculation!B478","v":"Coupling Relay"},{"$f":"Products!B77","v":0},{"$f":"Calculation!D478","v":17},0]
[null,"100117",{"$f":"Calculation!B479","v":"RGBW 24V Dimmer DMX"},{"$f":"Products!B27","v":0},{"$f":"Calculation!D479","v":34},0]
[null,"200001",{"$f":"Calculation!B480","v":"24V Power Supply (1.3A)"},{"$f":"Products!B55","v":0},{"$f":"Calculation!D480","v":53},0]
[null,"200002",{"$f":"Calculation!B481","v":"24V Power Supply (4.2A)"},{"$f":"Products!B56","v":0},{"$f":"Calculation!D481","v":90},0]
[null,"200035",{"$f":"Calculation!B482","v":"24V Power Supply (10A)"},{"$f":"Products!B71","v":0},{"$f":"Calculation!D482","v":83},0]
[null,"200143",{"$f":"Calculation!B483","v":"24V Power Supply (0.4A)"},{"$f":"Products!B111","v":0},{"$f":"Calculation!D483","v":18},0]
[null,"200156",{"$f":"Calculation!B484","v":"not available in this country"},{"$f":"Products!B117","v":0},{"$f":"Calculation!D484","v":17.5},0]
[null,"200157",{"$f":"Calculation!B485","v":"not available in this country"},{"$f":"Products!B118","v":0},{"$f":"Calculation!D485","v":70},0]
[null,"200168",{"$f":"Calculation!B486","v":"Push In Terminal Block 8x4 Interconnected (20 pcs)"},{"$f":"Products!B120","v":0},{"$f":"Calculation!D486","v":120},0]
[null,"200169",{"$f":"Calculation!B487","v":"Push In Terminal Block 8x4 Seperated (20pcs)"},{"$f":"Products!B121","v":0},{"$f":"Calculation!D487","v":120},0]
[null,"200173",{"$f":"Calculation!B488","v":"Push In Terminal Block 3+Earth (50 pcs)"},{"$f":"Products!B125","v":0},{"$f":"Calculation!D488","v":104},0]
[null,"200175",{"$f":"Calculation!B489","v":"Push In Terminal Block Twin+Earth (50 pcs)"},{"$f":"Products!B127","v":0},{"$f":"Calculation!D489","v":100},0]
[null,"200178",{"$f":"Calculation!B490","v":"Push in Fused Terminal Block (25 pcs)"},{"$f":"Products!B130","v":0},{"$f":"Calculation!D490","v":70},0]
[null,{"$f":"Products!C160","v":100200},{"$f":"Calculation!B492","v":"Dali Extension"},{"$f":"Products!B160","v":0},{"$f":"Calculation!D492","v":34},0]
[null,{"$f":"Products!C150","v":100218},{"$f":"Calculation!B491","v":"Tree Extension"},{"$f":"Products!B150","v":0},{"$f":"Calculation!D491","v":34},0]
[null,{"$f":"Products!C186","v":100239},{"$f":"Calculation!B493","v":"RGBW 24V Dimmer Tree"},{"$f":"Products!B186","v":0},{"$f":"Calculation!D493","v":34},0]

{"sheet":"Products","index":18,"n_rows":219,"n_cols":17,"rows_kept":219,"cut":false,"hidden":false,"merged":[[212,3,212,5],[208,3,208,4],[2,1,3,6],[191,4,191,5]]}
[]
[]
[null,{"$f":"VLOOKUP(Main!C2,Translating_general!A77:AF94,2,FALSE)","v":"Parts List"}]
[]
[]
[null,{"$f":"VLOOKUP(Main!C2,Translating_general!A77:AF94,3,FALSE)","v":"Quantity"},{"$f":"VLOOKUP(Main!C2,Translating_general!A77:AF94,4,FALSE)","v":"Nr."},{"$f":"VLOOKUP(Main!C2,Translating_general!A77:AF94,5,FALSE)","v":"Description"},{"$f":"VLOOKUP(Main!C2,Translating_general!A77:AF94,6,FALSE)","v":"Unit Net"},{"$f":"VLOOKUP(Main!C2,Translating_general!A77:AF94,7,FALSE)","v":"Unit Gross"},{"$f":"VLOOKUP(Main!C2,Translating_general!A77:AF94,8,FALSE)","v":"Total"},null,"Kategorie","AI (Eingang)","DI (Eingang)","AO (Ausgang)","DO (Ausgang)","Kanäle","Ampere gesamt pro Produkt","Watt gesamt pro Produkt"]
[null,{"$f":"Calculation!C5+Calculation!C46+Calculation!C380","v":0},{"$f":"HLOOKUP(Main!$C$2,Translating_products!$CN$4:$DD$216,Translating_products!CM5, FALSE)","v":100001},{"$f":"HLOOKUP(Main!$C$2,Translating_products!$DI$4:$DY$216,Translating_products!CM5, FALSE)","v":"Miniserver"},{"$f":"IF(ISBLANK($Q$1),HLOOKUP(Main!$C$2,Translating_products!$EE$4:$EU$216,Translating_products!CM5,FALSE),HLOOKUP($Q$1,Translating_products!$EE$4:$EU$216,Translating_products!CM5,FALSE))","v":549},{"$f":"E7*(1+$E$191*0.01)","v":549},{"$f":"B7*F7","v":0},{"$f":"SUM(G7:G137)","v":0},"Extension",4.0,8.0,4.0,8.0,null,{"$f":"0.12*B7","v":0},null,{"$f":"IF(ISBLANK($Q$1),VLOOKUP(Main!C2,Translating_general!A77:AG94,33,FALSE),VLOOKUP($Q$1,Translating_general!A77:AG94,33,FALSE))","v":"$"}]
[null,{"$f":"Calculation!C381+Calculation!C27+Calculation!C34","v":0},{"$f":"HLOOKUP(Main!$C$2,Translating_products!$CN$4:$DD$216,Translating_products!CM6, FALSE)","v":100002},{"$f":"HLOOKUP(Main!$C$2,Translating_products!$DI$4:$DY$216,Translating_products!CM6, FALSE)","v":"Extension"},{"$f":"IF(ISBLANK($Q$1),HLOOKUP(Main!$C$2,Translating_products!$EE$4:$EU$216,Translating_products!CM6,FALSE),HLOOKUP($Q$1,Translating_products!$EE$4:$EU$216,Translating_products!CM6,FALSE))","v":449},449,0,{"$f":"IF(B7:B137>0,1,0)","v":0},"Extension",4.0,12.0,4.0,8.0,null,{"$f":"B8*0.06","v":0},null,{"$f":"$Q$7","v":"$"}]
[null,{"$f":"Calculation!C326","v":0},{"$f":"HLOOKUP(Main!$C$2,Translating_products!$CN$4:$DD$216,Translating_products!CM7, FALSE)","v":100005},{"$f":"HLOOKUP(Main!$C$2,Translating_products!$DI$4:$DY$216,Translating_products!CM7, FALSE)","v":"Rollup Banner English"},{"$f":"IF(ISBLANK($Q$1),HLOOKUP(Main!$C$2,Translating_products!$EE$4:$EU$216,Translating_products!CM7,FALSE),HLOOKUP($Q$1,Translating_products!$EE$4:$EU$216,Translating_products!CM7,FALSE))","v":119},119,0,null,"Sonstiges",null,null,null,null,null,"nix",null,"$"]
[null,{"$f":"Calculation!C281","v":0},{"$f":"HLOOKUP(Main!$C$2,Translating_products!$CN$4:$DD$216,Translating_products!CM8, FALSE)","v":100008},{"$f":"HLOOKUP(Main!$C$2,Translating_products!$DI$4:$DY$216,Translating_products!CM8, FALSE)","v":"Micro SD Card with firmware"},{"$f":"IF(ISBLANK($Q$1),HLOOKUP(Main!$C$2,Translating_products!$EE$4:$EU$216,Translating_products!CM8,FALSE),HLOOKUP($Q$1,Translating_products!$EE$4:$EU$216,Translating_products!CM8,FALSE))","v":14},14,0,null,"Sonstiges",null,null,null,null,null,"nix",null,"$"]
[null,{"$f":"Calculation!C282+Calculation!C382","v":0},{"$f":"HLOOKUP(Main!$C$2,Translating_products!$CN$4:$DD$216,Translating_products!CM9, FALSE)","v":100011},{"$f":"HLOOKUP(Main!$C$2,Translating_products!$DI$4:$DY$216,Translating_products!CM9, FALSE)","v":"RS485 Extension"},{"$f":"IF(ISBLANK($Q$1),HLOOKUP(Main!$C$2,Translating_products!$EE$4:$EU$216,Translating_products!CM9,FALSE),HLOOKUP($Q$1,Translating_products!$EE$4:$EU$216,Translating_products!CM9,FALSE))","v":199},199,0,"Sonstiges wird einfach ausgewählt","Sonstiges/Extension",null,null,null,null,null,{"$f":"B11*0.03","v":0},null,"$"]
[null,{"$f":"Calculation!C76+Calculation!C383+Calculation!E512","v":0},{"$f":"HLOOKUP(Main!$C$2,Translating_products!$CN$4:$DD$216,Translating_products!CM10, FALSE)","v":100012},{"$f":"HLOOKUP(Main!$C$2,Translating_products!$DI$4:$DY$216,Translating_products!CM10, FALSE)","v":"DMX Extension"},{"$f":"IF(ISBLANK($Q$1),HLOOKUP(Main!$C$2,Translating_products!$EE$4:$EU$216,Translating_products!CM10,FALSE),HLOOKUP($Q$1,Translating_products!$EE$4:$EU$216,Translating_products!CM10,FALSE))","v":299},299,0,null,"Licht/Extension",null,null,null,null,128.0,0.03,null,"$"]
[null,{"$f":"Calculation!C283+Calculation!C384","v":0},{"$f":"HLOOKUP(Main!$C$2,Translating_products!$CN$4:$DD$216,Translating_products!CM11, FALSE)","v":100013},{"$f":"HLOOKUP(Main!$C$2,Translating_products!$DI$4:$DY$216,Translating_products!CM11, FALSE)","v":"RS 232 Extension"},{"$f":"IF(ISBLANK($Q$1),HLOOKUP(Main!$C$2,Translating_products!$EE$4:$EU$216,Translating_products!CM11,FALSE),HLOOKUP($Q$1,Translating_products!$EE$4:$EU$216,Translating_products!CM11,FALSE))","v":199},199,0,"Sonstiges wird einfach ausgewählt","Sonstiges/Extension",null,null,null,null,null,{"$f":"0.03*B13","v":0},null,"$"]
[null,{"$f":"Calculation!C12+Calculation!C39+Calculation!C385+Calculation!G157","v":0},{"$f":"HLOOKUP(Main!$C$2,Translating_products!$CN$4:$DD$216,Translating_products!CM12, FALSE)","v":100014},{"$f":"HLOOKUP(Main!$C$2,Translating_products!$DI$4:$DY$216,Translating_products!CM12, FALSE)","v":"1-Wire Extension"},{"$f":"IF(ISBLANK($Q$1),HLOOKUP(Main!$C$2,Translating_products!$EE$4:$EU$216,Translating_products!CM12,FALSE),HLOOKUP($Q$1,Translating_products!$EE$4:$EU$216,Translating_products!CM12,FALSE))","v":199},199,0,"Temparaturfühler & iButton; 20 Fühler möglich, Lesegerät für Zutritt 1x Fühler benötigt","Extension",null,null,null,null,20.0,0,null,"$"]
[null,{"$f":"Calculation!C41+Calculation!C284+Calculation!C386","v":0},{"$f":"HLOOKUP(Main!$C$2,Translating_products!$CN$4:$DD$216,Translating_products!CM13, FALSE)","v":"not available in this country"},{"$f":"HLOOKUP(Main!$C$2,Translating_products!$DI$4:$DY$216,Translating_products!CM13, FALSE)","v":"not available in this country"},{"$f":"IF(ISBLANK($Q$1),HLOOKUP(Main!$C$2,Translating_products!$EE$4:$EU$216,Translating_products!CM13,FALSE),HLOOKUP($Q$1,Translating_products!$EE$4:$EU$216,Translating_products!CM13,FALSE))","v":0},0,0,"Sonstiges wird einfach ausgewählt","Sonstiges/Extension",null,null,null,null,128.0,0,null,"$"]
[null,{"$f":"Calculation!C285","v":0},{"$f":"HLOOKUP(Main!$C$2,Translating_products!$CN$4:$DD$216,Translating_products!CM14, FALSE)","v":"No longer sold"},{"$f":"HLOOKUP(Main!$C$2,Translating_products!$DI$4:$DY$216,Translating_products!CM14, FALSE)","v":"No longer sold"},{"$f":"IF(ISBLANK($Q$1),HLOOKUP(Main!$C$2,Translating_products!$EE$4:$EU$216,Translating_products!CM14,FALSE),HLOOKUP($Q$1,Translating_products!$EE$4:$EU$216,Translating_products!CM14,FALSE))","v":0},0,0,null,"Sonstiges",null,null,null,null,null,"nix",null,"$"]
[null,{"$f":"Calculation!C286","v":0},{"$f":"HLOOKUP(Main!$C$2,Translating_products!$CN$4:$DD$216,Translating_products!CM15, FALSE)","v":100025},{"$f":"HLOOKUP(Main!$C$2,Translating_products!$DI$4:$DY$216,Translating_products!CM15, FALSE)","v":"Weather Service 1 Year"},{"$f":"IF(ISBLANK($Q$1),HLOOKUP(Main!$C$2,Translating_products!$EE$4:$EU$216,Translating_products!CM15,FALSE),HLOOKUP($Q$1,Translating_products!$EE$4:$EU$216,Translating_products!CM15,FALSE))","v":69},69,0,"Sonstiges","Sonstiges",null,null,null,null,null,"nix",null,"$"]
[null,{"$f":"Calculation!C287","v":0},{"$f":"HLOOKUP(Main!$C$2,Translating_products!$CN$4:$DD$216,Translating_products!CM16, FALSE)","v":100201},{"$f":"HLOOKUP(Main!$C$2,Translating_products!$DI$4:$DY$216,Translating_products!CM16, FALSE)","v":"Weather Service 10 Year"},{"$f":"IF(ISBLANK($Q$1),HLOOKUP(Main!$C$2,Translating_products!$EE$4:$EU$216,Translating_products!CM16,FALSE),HLOOKUP($Q$1,Translating_products!$EE$4:$EU$216,Translating_products!CM16,FALSE))","v":325},325,0,"Sonstiges","Sonstiges",null,null,null,null,null,"nix",null,"$"]
[null,{"$f":"Calculation!C288","v":0},{"$f":"HLOOKUP(Main!$C$2,Translating_products!$CN$4:$DD$216,Translating_products!CM17, FALSE)","v":100027},{"$f":"HLOOKUP(Main!$C$2,Translating_products!$DI$4:$DY$216,Translating_products!CM17, FALSE)","v":"Caller Service 1 Year"},{"$f":"IF(ISBLANK($Q$1),HLOOKUP(Main!$C$2,Translating_products!$EE$4:$EU$216,Translating_products!CM17,FALSE),HLOOKUP($Q$1,Translating_products!$EE$4:$EU$216,Translating_products!CM17,FALSE))","v":69},69,0,"Sonstiges","Sonstiges",null,null,null,null,null,"nix",null,"$"]
[null,{"$f":"Calculation!C289","v":0},{"$f":"HLOOKUP(Main!$C$2,Translating_products!$CN$4:$DD$216,Translating_products!CM18, FALSE)","v":100028},{"$f":"HLOOKUP(Main!$C$2,Translating_products!$DI$4:$DY$216,Translating_products!CM18, FALSE)","v":"Caller Service 10 Years"},{"$f":"IF(ISBLANK($Q$1),HLOOKUP(Main!$C$2,Translating_products!$EE$4:$EU$216,Translating_products!CM18,FALSE),HLOOKUP($Q$1,Translating_products!$EE$4:$EU$216,Translating_products!CM18,FALSE))","v":325},325,0,"Sonstiges","Sonstiges",null,null,null,null,null,"nix",null,"$"]
[null,{"$f":"Calculation!C388+Calculation!C77","v":0},{"$f":"HLOOKUP(Main!$C$2,Translating_products!$CN$4:$DD$216,Translating_products!CM19, FALSE)","v":100029},{"$f":"HLOOKUP(Main!$C$2,Translating_products!$DI$4:$DY$216,Translating_products!CM19, FALSE)","v":"Dimmer Extension"},{"$f":"IF(ISBLANK($Q$1),HLOOKUP(Main!$C$2,Translating_products!$EE$4:$EU$216,Translating_products!CM19,FALSE),HLOOKUP($Q$1,Translating_products!$EE$4:$EU$216,Translating_products!CM19,FALSE))","v":499},499,0,"Kein Netzteil 230V Dimmkanal (4 Dimmkanäle = 4 Kanäle)","Licht/Extension",null,8.0,4.0,null,null,{"$f":"B21*0.06","v":0},null,"$"]
[null,{"$f":"Calculation!C290","v":0},{"$f":"HLOOKUP(Main!$C$2,Translating_products!$CN$4:$DD$216,Translating_products!CM20, FALSE)","v":100035},{"$f":"HLOOKUP(Main!$C$2,Translating_products!$DI$4:$DY$216,Translating_products!CM20, FALSE)","v":"IR Set"},{"$f":"IF(ISBLANK($Q$1),HLOOKUP(Main!$C$2,Translating_products!$EE$4:$EU$216,Translating_products!CM20,FALSE),HLOOKUP($Q$1,Translating_products!$EE$4:$EU$216,Translating_products!CM20,FALSE))","v":229},229,0,null,"Sonstiges",null,null,null,null,null,0.03,null,"$"]
[null,{"$f":"Calculation!C389+Calculation!C37","v":0},{"$f":"HLOOKUP(Main!$C$2,Translating_products!$CN$4:$DD$216,Translating_products!CM21, FALSE)","v":100038},{"$f":"HLOOKUP(Main!$C$2,Translating_products!$DI$4:$DY$216,Translating_products!CM21, FALSE)","v":"Relay Extension"},{"$f":"IF(ISBLANK($Q$1),HLOOKUP(Main!$C$2,Translating_products!$EE$4:$EU$216,Translating_products!CM21,FALSE),HLOOKUP($Q$1,Translating_products!$EE$4:$EU$216,Translating_products!CM21,FALSE))","v":539},539,0,null,"Extension",null,null,null,14.0,null,{"$f":"0.3*B23","v":0},null,"$"]
[null,{"$f":"Calculation!C221+Calculation!C390+Calculation!C43","v":0},{"$f":"HLOOKUP(Main!$C$2,Translating_products!$CN$4:$DD$216,Translating_products!CM22, FALSE)","v":100114},{"$f":"HLOOKUP(Main!$C$2,Translating_products!$DI$4:$DY$216,Translating_products!CM22, FALSE)","v":"Air Base Extension"},{"$f":"IF(ISBLANK($Q$1),HLOOKUP(Main!$C$2,Translating_products!$EE$4:$EU$216,Translating_products!CM22,FALSE),HLOOKUP($Q$1,Translating_products!$EE$4:$EU$216,Translating_products!CM22,FALSE))","v":113},113,0,"128 Sockets/Geräte gelernt werden","Air/Extension",null,null,null,null,128.0,0.006,null,"$"]
[null,{"$f":"Calculation!C222","v":0},{"$f":"IF(ISBLANK($Q$1), HLOOKUP(Main!$C$2,Translating_products!$CN$4:$DD$216,Translating_products!CM23,FALSE),HLOOKUP($Q$1,Translating_products!$CN$4:$DD$216,Translating_products!CM23,FALSE))","v":"not available in this country"},{"$f":"IF(ISBLANK($Q$1),HLOOKUP(Main!$C$2,Translating_products!$DI$4:$DY$216,Translating_products!CM23, FALSE), HLOOKUP($Q$1,Translating_products!$DI$4:$DY$216,Translating_products!CM23, FALSE))","v":"not available in this country"},{"$f":"IF(ISBLANK($Q$1),HLOOKUP(Main!$C$2,Translating_products!$EE$4:$EU$216,Translating_products!CM23,FALSE),HLOOKUP($Q$1,Translating_products!$EE$4:$EU$216,Translating_products!CM23,FALSE))","v":0},0,0,"belegt 1 Kanal auf AirBaseExtension","Air",null,null,null,null,1.0,"nix",null,"$"]
[null,{"$f":"Calculation!C223+Calculation!C391","v":0},{"$f":"HLOOKUP(Main!$C$2,Translating_products!$CN$4:$DD$216,Translating_products!CM24, FALSE)","v":100116},{"$f":"HLOOKUP(Main!$C$2,Translating_products!$DI$4:$DY$216,Translating_products!CM24, FALSE)","v":"Multi Extension Air"},{"$f":"IF(ISBLANK($Q$1),HLOOKUP(Main!$C$2,Translating_products!$EE$4:$EU$216,Translating_products!CM24,FALSE),HLOOKUP($Q$1,Translating_products!$EE$4:$EU$216,Translating_products!CM24,FALSE))","v":539},539,0,"Stück-Auswahl","Air/Extension",null,12.0,null,8.0,20.0,"0,4 A Netzt. Pro Ext.",null,"$"]
[null,{"$f":"Calculation!C78","v":0},{"$f":"HLOOKUP(Main!$C$2,Translating_products!$CN$4:$DD$216,Translating_products!CM25, FALSE)","v":100117},{"$f":"HLOOKUP(Main!$C$2,Translating_products!$DI$4:$DY$216,Translating_products!CM25, FALSE)","v":"RGBW 24V Dimmer DMX"},{"$f":"IF(ISBLANK($Q$1),HLOOKUP(Main!$C$2,Translating_products!$EE$4:$EU$216,Translating_products!CM25,FALSE),HLOOKUP($Q$1,Translating_products!$EE$4:$EU$216,Translating_products!CM25,FALSE))","v":82},82,0,"belegt 4Kanäle auf DMX Extension","Licht",null,null,null,null,4.0,"nix",null,"$"]
[null,{"$f":"Calculation!C387","v":0},{"$f":"HLOOKUP(Main!$C$2,Translating_products!$CN$4:$DD$216,Translating_products!CM26, FALSE)","v":100124},{"$f":"HLOOKUP(Main!$C$2,Translating_products!$DI$4:$DY$216,Translating_products!CM26, FALSE)","v":"Modbus Extension"},{"$f":"IF(ISBLANK($Q$1),HLOOKUP(Main!$C$2,Translating_products!$EE$4:$EU$216,Translating_products!CM26,FALSE),HLOOKUP($Q$1,Translating_products!$EE$4:$EU$216,Translating_products!CM26,FALSE))","v":255},255,0,"Sonstiges-Auswählen","Sonstiges",null,null,null,null,null,{"$f":"B28*0.03","v":0},null,"$"]
[null,{"$f":"Calculation!C79","v":0},{"$f":"HLOOKUP(Main!$C$2,Translating_products!$CN$4:$DD$216,Translating_products!CM27, FALSE)","v":100125},{"$f":"HLOOKUP(Main!$C$2,Translating_products!$DI$4:$DY$216,Translating_products!CM27, FALSE)","v":"RGBW 24V Dimmer Air"},{"$f":"IF(ISBLANK($Q$1),HLOOKUP(Main!$C$2,Translating_products!$EE$4:$EU$216,Translating_products!CM27,FALSE),HLOOKUP($Q$1,Translating_products!$EE$4:$EU$216,Translating_products!CM27,FALSE))","v":96},96,0,"belegt 1 Kanal auf AirbaseExtension","Licht",null,null,null,null,1.0,"nix",null,"$"]
[null,{"$f":"Calculation!C224+Calculation!C392+Calculation!C6","v":0},{"$f":"HLOOKUP(Main!$C$2,Translating_products!$CN$4:$DD$216,Translating_products!CM28, FALSE)","v":100139},{"$f":"HLOOKUP(Main!$C$2,Translating_products!$DI$4:$DY$216,Translating_products!CM28, FALSE)","v":"Miniserver Go"},{"$f":"IF(ISBLANK($Q$1),HLOOKUP(Main!$C$2,Translating_products!$EE$4:$EU$216,Translating_products!CM28,FALSE),HLOOKUP($Q$1,Translating_products!$EE$4:$EU$216,Translating_products!CM28,FALSE))","v":349},349,0,"wird ausgewählt (für Nachrüster)","Air/Extension",null,null,null,null,128.0,"nix",null,"$"]
[null,{"$f":"Calculation!C225","v":0},{"$f":"HLOOKUP(Main!$C$2,Translating_products!$CN$4:$DD$216,Translating_products!CM29, FALSE)","v":100140},{"$f":"HLOOKUP(Main!$C$2,Translating_products!$DI$4:$DY$216,Translating_products!CM29, FALSE)","v":"Remote Air"},{"$f":"IF(ISBLANK($Q$1),HLOOKUP(Main!$C$2,Translating_products!$EE$4:$EU$216,Translating_products!CM29,FALSE),HLOOKUP($Q$1,Translating_products!$EE$4:$EU$216,Translating_products!CM29,FALSE))","v":55.5},55.5,0,"belegt 1 Kanal auf MsGo oder Extension","Air",null,null,null,null,1.0,"nix",null,"$"]
[null,{"$f":"Calculation!C226","v":0},{"$f":"HLOOKUP(Main!$C$2,Translating_products!$CN$4:$DD$216,Translating_products!CM30, FALSE)","v":100141},{"$f":"HLOOKUP(Main!$C$2,Translating_products!$DI$4:$DY$216,Translating_products!CM30, FALSE)","v":"IR Control Air"},{"$f":"IF(ISBLANK($Q$1),HLOOKUP(Main!$C$2,Translating_products!$EE$4:$EU$216,Translating_products!CM30,FALSE),HLOOKUP($Q$1,Translating_products!$EE$4:$EU$216,Translating_products!CM30,FALSE))","v":124.9},124.9,0,"belegt 1 Kanal auf MsGo oder Extension","Air",null,null,null,null,1.0,"nix",null,"$"]
[null,{"$f":"Calculation!C227","v":0},{"$f":"HLOOKUP(Main!$C$2,Translating_products!$CN$4:$DD$216,Translating_products!CM31, FALSE)","v":100142},{"$f":"HLOOKUP(Main!$C$2,Translating_products!$DI$4:$DY$216,Translating_products!CM31, FALSE)","v":"Smoke Detector Air"},{"$f":"IF(ISBLANK($Q$1),HLOOKUP(Main!$C$2,Translating_products!$EE$4:$EU$216,Translating_products!CM31,FALSE),HLOOKUP($Q$1,Translating_products!$EE$4:$EU$216,Translating_products!CM31,FALSE))","v":99},99,0,"belegt 1 Kanal auf MsGo oder Extension","Air",null,null,null,null,1.0,"nix",null,"$"]
[null,{"$f":"Calculation!C228","v":0},{"$f":"HLOOKUP(Main!$C$2,Translating_products!$CN$4:$DD$216,Translating_products!CM32, FALSE)","v":100149},{"$f":"HLOOKUP(Main!$C$2,Translating_products!$DI$4:$DY$216,Translating_products!CM32, FALSE)","v":"Temperature & Humidity Sesnor Air"},{"$f":"IF(ISBLANK($Q$1),HLOOKUP(Main!$C$2,Translating_products!$EE$4:$EU$216,Translating_products!CM32,FALSE),HLOOKUP($Q$1,Translating_products!$EE$4:$EU$216,Translating_products!CM32,FALSE))","v":79},79,0,"belegt 1 Kanal auf MsGo oder Extension","Air",null,null,null,null,1.0,"nix",null,"$"]
[null,{"$f":"Calculation!C216","v":0},{"$f":"HLOOKUP(Main!$C$2,Translating_products!$CN$4:$DD$216,Translating_products!CM33, FALSE)","v":100150},{"$f":"HLOOKUP(Main!$C$2,Translating_products!$DI$4:$DY$216,Translating_products!CM33, FALSE)","v":"Loxone Tool Kit by Weidmüller"},{"$f":"IF(ISBLANK($Q$1),HLOOKUP(Main!$C$2,Translating_products!$EE$4:$EU$216,Translating_products!CM33,FALSE),HLOOKUP($Q$1,Translating_products!$EE$4:$EU$216,Translating_products!CM33,FALSE))","v":339},339,0,"Stück-Auswahl Sonstiges","Sonstiges",null,null,null,null,null,"nix",null,"$"]
[null,{"$f":"Calculation!C229","v":0},{"$f":"HLOOKUP(Main!$C$2,Translating_products!$CN$4:$DD$216,Translating_products!CM34, FALSE)","v":"not available in this country"},{"$f":"HLOOKUP(Main!$C$2,Translating_products!$DI$4:$DY$216,Translating_products!CM34, FALSE)","v":"not available in this country"},{"$f":"IF(ISBLANK($Q$1),HLOOKUP(Main!$C$2,Translating_products!$EE$4:$EU$216,Translating_products!CM34,FALSE),HLOOKUP($Q$1,Translating_products!$EE$4:$EU$216,Translating_products!CM34,FALSE))","v":0},0,0,"belegt 1 Kanal auf MsGo oder Extension","Air",null,null,null,null,1.0,"nix",null,"$"]
[null,{"$f":"Calculation!C245+Calculation!C92+Calculation!C339","v":0},{"$f":"HLOOKUP(Main!$C$2,Translating_products!$CN$4:$DD$216,Translating_products!CM35, FALSE)","v":100153},{"$f":"HLOOKUP(Main!$C$2,Translating_products!$DI$4:$DY$216,Translating_products!CM35, FALSE)","v":"Nano IO Air"},{"$f":"IF(ISBLANK($Q$1),HLOOKUP(Main!$C$2,Translating_products!$EE$4:$EU$216,Translating_products!CM35,FALSE),HLOOKUP($Q$1,Translating_products!$EE$4:$EU$216,Translating_products!CM35,FALSE))","v":119},119,0,"belegt 1 Kanal auf MsGo oder Extension","Beschattung",null,null,null,null,1.0,"nix",null,"$"]
[null,{"$f":"Calculation!C230+Calculation!C361","v":0},{"$f":"HLOOKUP(Main!$C$2,Translating_products!$CN$4:$DD$216,Translating_products!CM36, FALSE)","v":100154},{"$f":"HLOOKUP(Main!$C$2,Translating_products!$DI$4:$DY$216,Translating_products!CM36, FALSE)","v":"Loxone Touch for Nano White"},{"$f":"IF(ISBLANK($Q$1),HLOOKUP(Main!$C$2,Translating_products!$EE$4:$EU$216,Translating_products!CM36,FALSE),HLOOKUP($Q$1,Translating_products!$EE$4:$EU$216,Translating_products!CM36,FALSE))","v":49},49,0,null,"Air",null,null,null,null,null,"nix",null,"$"]
[null,{"$f":"Calculation!C231+Calculation!C362","v":0},{"$f":"HLOOKUP(Main!$C$2,Translating_products!$CN$4:$DD$216,Translating_products!CM37, FALSE)","v":100155},{"$f":"HLOOKUP(Main!$C$2,Translating_products!$DI$4:$DY$216,Translating_products!CM37, FALSE)","v":"Loxone Touch Air White"},{"$f":"IF(ISBLANK($Q$1),HLOOKUP(Main!$C$2,Translating_products!$EE$4:$EU$216,Translating_products!CM37,FALSE),HLOOKUP($Q$1,Translating_products!$EE$4:$EU$216,Translating_products!CM37,FALSE))","v":124},124,0,"belegt 1 Kanal auf MsGo oder Extension","Air",null,null,null,null,1.0,"nix",null,"$"]
[null,{"$f":"Calculation!C393","v":0},{"$f":"HLOOKUP(Main!$C$2,Translating_products!$CN$4:$DD$216,Translating_products!CM38, FALSE)","v":"not available in this country"},{"$f":"HLOOKUP(Main!$C$2,Translating_products!$DI$4:$DY$216,Translating_products!CM38, FALSE)","v":"not available in this country"},{"$f":"IF(ISBLANK($Q$1),HLOOKUP(Main!$C$2,Translating_products!$EE$4:$EU$216,Translating_products!CM38,FALSE),HLOOKUP($Q$1,Translating_products!$EE$4:$EU$216,Translating_products!CM38,FALSE))","v":0},0,0,"Sonstiges -kann man einfach kaufen","Sonstiges",null,null,null,null,null,0.03,null,"$"]
[null,{"$f":"Calculation!C232+Calculation!C133","v":0},{"$f":"HLOOKUP(Main!$C$2,Translating_products!$CN$4:$DD$216,Translating_products!CM39, FALSE)","v":100163},{"$f":"HLOOKUP(Main!$C$2,Translating_products!$DI$4:$DY$216,Translating_products!CM39, FALSE)","v":"Valve Actuator Air"},{"$f":"IF(ISBLANK($Q$1),HLOOKUP(Main!$C$2,Translating_products!$EE$4:$EU$216,Translating_products!CM39,FALSE),HLOOKUP($Q$1,Translating_products!$EE$4:$EU$216,Translating_products!CM39,FALSE))","v":86},86,0,"belegt 1 Kanal auf MsGo oder Extension","Air",null,null,null,null,1.0,"nix",null,"$"]
[null,{"$f":"Calculation!C117+Calculation!H119","v":0},{"$f":"HLOOKUP(Main!$C$2,Translating_products!$CN$4:$DD$216,Translating_products!CM40, FALSE)","v":100165},{"$f":"HLOOKUP(Main!$C$2,Translating_products!$DI$4:$DY$216,Translating_products!CM40, FALSE)","v":"Loxone Music Server 4 Zone"},{"$f":"IF(ISBLANK($Q$1),HLOOKUP(Main!$C$2,Translating_products!$EE$4:$EU$216,Translating_products!CM40,FALSE),HLOOKUP($Q$1,Translating_products!$EE$4:$EU$216,Translating_products!CM40,FALSE))","v":1249},1249,0,"Stück-Auswahl","Musik",null,null,null,null,null,"nix",null,"$"]
[null,{"$f":"Calculation!C118+Calculation!H120","v":0},{"$f":"HLOOKUP(Main!$C$2,Translating_products!$CN$4:$DD$216,Translating_products!CM41, FALSE)","v":100166},{"$f":"HLOOKUP(Main!$C$2,Translating_products!$DI$4:$DY$216,Translating_products!CM41, FALSE)","v":"Loxone Music Server 8 Zone"},{"$f":"IF(ISBLANK($Q$1),HLOOKUP(Main!$C$2,Translating_products!$EE$4:$EU$216,Translating_products!CM41,FALSE),HLOOKUP($Q$1,Translating_products!$EE$4:$EU$216,Translating_products!CM41,FALSE))","v":1849},1849,0,"Stück-Auswahl","Musik",null,null,null,null,null,"nix",null,"$"]
[null,{"$f":"Calculation!C119+Calculation!H121","v":0},{"$f":"HLOOKUP(Main!$C$2,Translating_products!$CN$4:$DD$216,Translating_products!CM42, FALSE)","v":100167},{"$f":"HLOOKUP(Main!$C$2,Translating_products!$DI$4:$DY$216,Translating_products!CM42, FALSE)","v":"Loxone Music Server 12 Zone"},{"$f":"IF(ISBLANK($Q$1),HLOOKUP(Main!$C$2,Translating_products!$EE$4:$EU$216,Translating_products!CM42,FALSE),HLOOKUP($Q$1,Translating_products!$EE$4:$EU$216,Translating_products!CM42,FALSE))","v":2099},2099,0,"Stück-Auswahl","Musik",null,null,null,null,null,"nix",null,"$"]
[null,{"$f":"Calculation!C120+Calculation!H122","v":0},{"$f":"HLOOKUP(Main!$C$2,Translating_products!$CN$4:$DD$216,Translating_products!CM43, FALSE)","v":100168},{"$f":"HLOOKUP(Main!$C$2,Translating_products!$DI$4:$DY$216,Translating_products!CM43, FALSE)","v":"Loxone Music Server 16 Zone"},{"$f":"IF(ISBLANK($Q$1),HLOOKUP(Main!$C$2,Translating_products!$EE$4:$EU$216,Translating_products!CM43,FALSE),HLOOKUP($Q$1,Translating_products!$EE$4:$EU$216,Translating_products!CM43,FALSE))","v":2649},2649,0,"Stück-Auswahl","Musik",null,null,null,null,null,"nix",null,"$"]
[null,{"$f":"Calculation!C121+Calculation!H123","v":0},{"$f":"HLOOKUP(Main!$C$2,Translating_products!$CN$4:$DD$216,Translating_products!CM44, FALSE)","v":100169},{"$f":"HLOOKUP(Main!$C$2,Translating_products!$DI$4:$DY$216,Translating_products!CM44, FALSE)","v":"Loxone Music Server 20 Zone"},{"$f":"IF(ISBLANK($Q$1),HLOOKUP(Main!$C$2,Translating_products!$EE$4:$EU$216,Translating_products!CM44,FALSE),HLOOKUP($Q$1,Translating_products!$EE$4:$EU$216,Translating_products!CM44,FALSE))","v":2999},2999,0,"Stück-Auswahl","Musik",null,null,null,null,null,"nix",null,"$"]
[null,{"$f":"Calculation!C327","v":0},{"$f":"HLOOKUP(Main!$C$2,Translating_products!$CN$4:$DD$216,Translating_products!CM45, FALSE)","v":"not available in this country"},{"$f":"HLOOKUP(Main!$C$2,Translating_products!$DI$4:$DY$216,Translating_products!CM45, FALSE)","v":"not available in this country"},{"$f":"IF(ISBLANK($Q$1),HLOOKUP(Main!$C$2,Translating_products!$EE$4:$EU$216,Translating_products!CM45,FALSE),HLOOKUP($Q$1,Translating_products!$EE$4:$EU$216,Translating_products!CM45,FALSE))","v":0},0,0,"Stück-Auswahl","Sonstiges",null,null,null,null,null,"nix",null,"$"]
[null,{"$f":"Calculation!C292","v":0},{"$f":"HLOOKUP(Main!$C$2,Translating_products!$CN$4:$DD$216,Translating_products!CM46, FALSE)","v":100178},{"$f":"HLOOKUP(Main!$C$2,Translating_products!$DI$4:$DY$216,Translating_products!CM46, FALSE)","v":"AquaStar Air 1.5\""},{"$f":"IF(ISBLANK($Q$1),HLOOKUP(Main!$C$2,Translating_products!$EE$4:$EU$216,Translating_products!CM46,FALSE),HLOOKUP($Q$1,Translating_products!$EE$4:$EU$216,Translating_products!CM46,FALSE))","v":1549},1549,0,"Stück-Auswahl","Sonstiges",null,null,null,null,null,"nix",null,"$"]
[null,{"$f":"Calculation!C293","v":0},{"$f":"HLOOKUP(Main!$C$2,Translating_products!$CN$4:$DD$216,Translating_products!CM47, FALSE)","v":100179},{"$f":"HLOOKUP(Main!$C$2,Translating_products!$DI$4:$DY$216,Translating_products!CM47, FALSE)","v":"AquaStar Air 2\""},{"$f":"IF(ISBLANK($Q$1),HLOOKUP(Main!$C$2,Translating_products!$EE$4:$EU$216,Translating_products!CM47,FALSE),HLOOKUP($Q$1,Translating_products!$EE$4:$EU$216,Translating_products!CM47,FALSE))","v":1649},1649,0,"Stück-Auswahl","Sonstiges",null,null,null,null,null,"nix",null,"$"]
[null,{"$f":"Calculation!C239+Calculation!C364","v":0},{"$f":"HLOOKUP(Main!$C$2,Translating_products!$CN$4:$DD$216,Translating_products!CM48, FALSE)","v":100180},{"$f":"HLOOKUP(Main!$C$2,Translating_products!$DI$4:$DY$216,Translating_products!CM48, FALSE)","v":"Loxone Touch Air Anthracite"},{"$f":"IF(ISBLANK($Q$1),HLOOKUP(Main!$C$2,Translating_products!$EE$4:$EU$216,Translating_products!CM48,FALSE),HLOOKUP($Q$1,Translating_products!$EE$4:$EU$216,Translating_products!CM48,FALSE))","v":124},124,0,"belegt 1 Kanal auf MsGo oder Extension","Air",null,null,null,null,1.0,"nix",null,"$"]
[null,{"$f":"Calculation!C240+Calculation!C365","v":0},{"$f":"HLOOKUP(Main!$C$2,Translating_products!$CN$4:$DD$216,Translating_products!CM49, FALSE)","v":100181},{"$f":"HLOOKUP(Main!$C$2,Translating_products!$DI$4:$DY$216,Translating_products!CM49, FALSE)","v":"Loxone Touch for Nano Anthracite"},{"$f":"IF(ISBLANK($Q$1),HLOOKUP(Main!$C$2,Translating_products!$EE$4:$EU$216,Translating_products!CM49,FALSE),HLOOKUP($Q$1,Translating_products!$EE$4:$EU$216,Translating_products!CM49,FALSE))","v":49},49,0,null,"Air",null,null,null,null,null,"nix",null,"$"]
[null,{"$f":"Calculation!C241+Calculation!C341","v":0},{"$f":"HLOOKUP(Main!$C$2,Translating_products!$CN$4:$DD$216,Translating_products!CM50, FALSE)","v":"not available in this country"},{"$f":"HLOOKUP(Main!$C$2,Translating_products!$DI$4:$DY$216,Translating_products!CM50, FALSE)","v":"not available in this country"},{"$f":"IF(ISBLANK($Q$1),HLOOKUP(Main!$C$2,Translating_products!$EE$4:$EU$216,Translating_products!CM50,FALSE),HLOOKUP($Q$1,Translating_products!$EE$4:$EU$216,Translating_products!CM50,FALSE))","v":0},0,0,"belegt 1 Kanal auf MsGo oder Extension","Air",null,null,null,null,1.0,"nix",null,"$"]
[null,{"$f":"Calculation!C242+Calculation!C342","v":0},{"$f":"HLOOKUP(Main!$C$2,Translating_products!$CN$4:$DD$216,Translating_products!CM51, FALSE)","v":"not available in this country"},{"$f":"HLOOKUP(Main!$C$2,Translating_products!$DI$4:$DY$216,Translating_products!CM51, FALSE)","v":"not available in this country"},{"$f":"IF(ISBLANK($Q$1),HLOOKUP(Main!$C$2,Translating_products!$EE$4:$EU$216,Translating_products!CM51,FALSE),HLOOKUP($Q$1,Translating_products!$EE$4:$EU$216,Translating_products!CM51,FALSE))","v":0},0,0,"belegt 1 Kanal auf MsGo oder Extension","Air",null,null,null,null,1.0,"nix",null,"$"]
[null,{"$f":"Calculation!C243+Calculation!C343","v":0},{"$f":"HLOOKUP(Main!$C$2,Translating_products!$CN$4:$DD$216,Translating_products!CM52, FALSE)","v":"not available in this country"},{"$f":"HLOOKUP(Main!$C$2,Translating_products!$DI$4:$DY$216,Translating_products!CM52, FALSE)","v":"not available in this country"},{"$f":"IF(ISBLANK($Q$1),HLOOKUP(Main!$C$2,Translating_products!$EE$4:$EU$216,Translating_products!CM52,FALSE),HLOOKUP($Q$1,Translating_products!$EE$4:$EU$216,Translating_products!CM52,FALSE))","v":0},0,0,"belegt 1 Kanal auf MsGo oder Extension","Air",null,null,null,null,1.0,"nix",null,"$"]
[null,{"$f":"Calculation!C294+Calculation!L401","v":0},{"$f":"HLOOKUP(Main!$C$2,Translating_products!$CN$4:$DD$216,Translating_products!CM53, FALSE)","v":200001},{"$f":"HLOOKUP(Main!$C$2,Translating_products!$DI$4:$DY$216,Translating_products!CM53, FALSE)","v":"24V Power Supply (1.3A)"},{"$f":"IF(ISBLANK($Q$1),HLOOKUP(Main!$C$2,Translating_products!$EE$4:$EU$216,Translating_products!CM53,FALSE),HLOOKUP($Q$1,Translating_products!$EE$4:$EU$216,Translating_products!CM53,FALSE))","v":49},49,0,"Auswählen & stehen auch mit anderen Produkten in Beziehung","Sonstiges",null,null,null,null,null,"nix",null,"$"]
[null,{"$f":"Calculation!C295+Calculation!L402","v":0},{"$f":"HLOOKUP(Main!$C$2,Translating_products!$CN$4:$DD$216,Translating_products!CM54, FALSE)","v":200002},{"$f":"HLOOKUP(Main!$C$2,Translating_products!$DI$4:$DY$216,Translating_products!CM54, FALSE)","v":"24V Power Supply (4.2A)"},{"$f":"IF(ISBLANK($Q$1),HLOOKUP(Main!$C$2,Translating_products!$EE$4:$EU$216,Translating_products!CM54,FALSE),HLOOKUP($Q$1,Translating_products!$EE$4:$EU$216,Translating_products!CM54,FALSE))","v":76},76,0,"Auswählen & stehen auch mit anderen Produkten in Beziehung","Sonstiges",null,null,null,null,null,"nix",null,"$"]
[null,{"$f":"Calculation!C134+Calculation!C168","v":0},{"$f":"HLOOKUP(Main!$C$2,Translating_products!$CN$4:$DD$216,Translating_products!CM55, FALSE)","v":200003},{"$f":"HLOOKUP(Main!$C$2,Translating_products!$DI$4:$DY$216,Translating_products!CM55, FALSE)","v":"Outside Temperature Sensor 0-10V"},{"$f":"IF(ISBLANK($Q$1),HLOOKUP(Main!$C$2,Translating_products!$EE$4:$EU$216,Translating_products!CM55,FALSE),HLOOKUP($Q$1,Translating_products!$EE$4:$EU$216,Translating_products!CM55,FALSE))","v":59},59,0,null,"Heizung",1.0,null,null,null,null,{"$f":"B57*0.005","v":0},null,"$"]
[null,0.0,{"$f":"HLOOKUP(Main!$C$2,Translating_products!$CN$4:$DD$216,Translating_products!CM56, FALSE)","v":0},{"$f":"HLOOKUP(Main!$C$2,Translating_products!$DI$4:$DY$216,Translating_products!CM56, FALSE)","v":"No longer sold"},{"$f":"IF(ISBLANK($Q$1),HLOOKUP(Main!$C$2,Translating_products!$EE$4:$EU$216,Translating_products!CM56,FALSE),HLOOKUP($Q$1,Translating_products!$EE$4:$EU$216,Translating_products!CM56,FALSE))","v":0},0,0,null,"Heizung",null,null,1.0,null,null,{"$f":"B58*0.27","v":0},null,"$"]
[null,0.0,{"$f":"HLOOKUP(Main!$C$2,Translating_products!$CN$4:$DD$216,Translating_products!CM57, FALSE)","v":0},{"$f":"HLOOKUP(Main!$C$2,Translating_products!$DI$4:$DY$216,Translating_products!CM57, FALSE)","v":"No longer sold"},{"$f":"IF(ISBLANK($Q$1),HLOOKUP(Main!$C$2,Translating_products!$EE$4:$EU$216,Translating_products!CM57,FALSE),HLOOKUP($Q$1,Translating_products!$EE$4:$EU$216,Translating_products!CM57,FALSE))","v":0},0,0,null,"Heizung",null,null,null,1.0,null,"nix",null,"$"]
[null,{"$f":"Calculation!C135+Calculation!C169","v":0},{"$f":"HLOOKUP(Main!$C$2,Translating_products!$CN$4:$DD$216,Translating_products!CM58, FALSE)","v":200006},{"$f":"HLOOKUP(Main!$C$2,Translating_products!$DI$4:$DY$216,Translating_products!CM58, FALSE)","v":"Indoor Temperature Sensor 0-10V"},{"$f":"IF(ISBLANK($Q$1),HLOOKUP(Main!$C$2,Translating_products!$EE$4:$EU$216,Translating_products!CM58,FALSE),HLOOKUP($Q$1,Translating_products!$EE$4:$EU$216,Translating_products!CM58,FALSE))","v":59},59,0,null,"Heizung",1.0,null,null,null,null,{"$f":"B60*0.005","v":0},null,"$"]
[null,{"$f":"Calculation!C296","v":0},{"$f":"HLOOKUP(Main!$C$2,Translating_products!$CN$4:$DD$216,Translating_products!CM59, FALSE)","v":"not available in this country"},{"$f":"HLOOKUP(Main!$C$2,Translating_products!$DI$4:$DY$216,Translating_products!CM59, FALSE)","v":"not available in this country"},{"$f":"IF(ISBLANK($Q$1),HLOOKUP(Main!$C$2,Translating_products!$EE$4:$EU$216,Translating_products!CM59,FALSE),HLOOKUP($Q$1,Translating_products!$EE$4:$EU$216,Translating_products!CM59,FALSE))","v":0},0,0,"Sonstiges-Stück","Sonstiges",null,null,null,null,null,"nix",null,"$"]
[null,{"$f":"Calculation!C136+Calculation!C170","v":0},{"$f":"HLOOKUP(Main!$C$2,Translating_products!$CN$4:$DD$216,Translating_products!CM60, FALSE)","v":200010},{"$f":"HLOOKUP(Main!$C$2,Translating_products!$DI$4:$DY$216,Translating_products!CM60, FALSE)","v":"Indoor Temperature & Humidity Sensor 0-10V"},{"$f":"IF(ISBLANK($Q$1),HLOOKUP(Main!$C$2,Translating_products!$EE$4:$EU$216,Translating_products!CM60,FALSE),HLOOKUP($Q$1,Translating_products!$EE$4:$EU$216,Translating_products!CM60,FALSE))","v":119},119,0,null,"Heizung",2.0,null,null,null,null,{"$f":"B62*0.005","v":0},null,"$"]
[null,{"$f":"Calculation!C297","v":0},{"$f":"HLOOKUP(Main!$C$2,Translating_products!$CN$4:$DD$216,Translating_products!CM61, FALSE)","v":200012},{"$f":"HLOOKUP(Main!$C$2,Translating_products!$DI$4:$DY$216,Translating_products!CM61, FALSE)","v":"Valve Adaptor VA80"},{"$f":"IF(ISBLANK($Q$1),HLOOKUP(Main!$C$2,Translating_products!$EE$4:$EU$216,Translating_products!CM61,FALSE),HLOOKUP($Q$1,Translating_products!$EE$4:$EU$216,Translating_products!CM61,FALSE))","v":2},2,0,"Sonstiges-Stück","Sonstiges",null,null,null,null,null,"nix",null,"$"]
[null,{"$f":"Calculation!C298","v":0},{"$f":"HLOOKUP(Main!$C$2,Translating_products!$CN$4:$DD$216,Translating_products!CM62, FALSE)","v":"not available in this country"},{"$f":"HLOOKUP(Main!$C$2,Translating_products!$DI$4:$DY$216,Translating_products!CM62, FALSE)","v":"not available in this country"},{"$f":"IF(ISBLANK($Q$1),HLOOKUP(Main!$C$2,Translating_products!$EE$4:$EU$216,Translating_products!CM62,FALSE),HLOOKUP($Q$1,Translating_products!$EE$4:$EU$216,Translating_products!CM62,FALSE))","v":0},0,0,"Sonstiges-Stück","Sonstiges",null,null,null,null,null,"nix",null,"$"]
[null,{"$f":"Calculation!C137+Calculation!C171","v":0},{"$f":"HLOOKUP(Main!$C$2,Translating_products!$CN$4:$DD$216,Translating_products!CM63, FALSE)","v":200017},{"$f":"HLOOKUP(Main!$C$2,Translating_products!$DI$4:$DY$216,Translating_products!CM63, FALSE)","v":"Indoor Temperature, Humidty & CO2 Sensor 0-10V"},{"$f":"IF(ISBLANK($Q$1),HLOOKUP(Main!$C$2,Translating_products!$EE$4:$EU$216,Translating_products!CM63,FALSE),HLOOKUP($Q$1,Translating_products!$EE$4:$EU$216,Translating_products!CM63,FALSE))","v":314},314,0,null,"Heizung",3.0,null,null,null,null,{"$f":"B65*0.01","v":0},null,"$"]
[null,{"$f":"Calculation!C172","v":0},{"$f":"HLOOKUP(Main!$C$2,Translating_products!$CN$4:$DD$216,Translating_products!CM64, FALSE)","v":200018},{"$f":"HLOOKUP(Main!$C$2,Translating_products!$DI$4:$DY$216,Translating_products!CM64, FALSE)","v":"Rain Sensor (24V)"},{"$f":"IF(ISBLANK($Q$1),HLOOKUP(Main!$C$2,Translating_products!$EE$4:$EU$216,Translating_products!CM64,FALSE),HLOOKUP($Q$1,Translating_products!$EE$4:$EU$216,Translating_products!CM64,FALSE))","v":79},79,0,null,"Sensoren",null,1.0,null,null,null,{"$f":"0.06*B66","v":0},null,"$"]
[null,{"$f":"Calculation!C173","v":0},{"$f":"HLOOKUP(Main!$C$2,Translating_products!$CN$4:$DD$216,Translating_products!CM65, FALSE)","v":200031},{"$f":"HLOOKUP(Main!$C$2,Translating_products!$DI$4:$DY$216,Translating_products!CM65, FALSE)","v":"Outdoor Temperature & Humidy Sensor 0-10V"},{"$f":"IF(ISBLANK($Q$1),HLOOKUP(Main!$C$2,Translating_products!$EE$4:$EU$216,Translating_products!CM65,FALSE),HLOOKUP($Q$1,Translating_products!$EE$4:$EU$216,Translating_products!CM65,FALSE))","v":159},159,0,null,"Sensoren",2.0,null,null,null,null,{"$f":"B67*0.005","v":0},null,"$"]
[null,{"$f":"Calculation!C174","v":0},{"$f":"HLOOKUP(Main!$C$2,Translating_products!$CN$4:$DD$216,Translating_products!CM66, FALSE)","v":200032},{"$f":"HLOOKUP(Main!$C$2,Translating_products!$DI$4:$DY$216,Translating_products!CM66, FALSE)","v":"Brightness Sensor 0-10V"},{"$f":"IF(ISBLANK($Q$1),HLOOKUP(Main!$C$2,Translating_products!$EE$4:$EU$216,Translating_products!CM66,FALSE),HLOOKUP($Q$1,Translating_products!$EE$4:$EU$216,Translating_products!CM66,FALSE))","v":109},109,0,null,"Sensoren",1.0,null,null,null,null,{"$f":"0.005*B68","v":0},null,"$"]
[null,{"$f":"Calculation!C175","v":0},{"$f":"HLOOKUP(Main!$C$2,Translating_products!$CN$4:$DD$216,Translating_products!CM67, FALSE)","v":200033},{"$f":"HLOOKUP(Main!$C$2,Translating_products!$DI$4:$DY$216,Translating_products!CM67, FALSE)","v":"Wind Sensor (24V)"},{"$f":"IF(ISBLANK($Q$1),HLOOKUP(Main!$C$2,Translating_products!$EE$4:$EU$216,Translating_products!CM67,FALSE),HLOOKUP($Q$1,Translating_products!$EE$4:$EU$216,Translating_products!CM67,FALSE))","v":99},99,0,null,"Sensoren",null,1.0,null,null,null,"nix",null,"$"]
[null,{"$f":"Calculation!C176","v":0},{"$f":"HLOOKUP(Main!$C$2,Translating_products!$CN$4:$DD$216,Translating_products!CM68, FALSE)","v":200034},{"$f":"HLOOKUP(Main!$C$2,Translating_products!$DI$4:$DY$216,Translating_products!CM68, FALSE)","v":"Wind Sensor Mount"},{"$f":"IF(ISBLANK($Q$1),HLOOKUP(Main!$C$2,Translating_products!$EE$4:$EU$216,Translating_products!CM68,FALSE),HLOOKUP($Q$1,Translating_products!$EE$4:$EU$216,Translating_products!CM68,FALSE))","v":75},75,0,"Stück-Auswahl","Sensoren",null,null,null,null,null,"nix",null,"$"]
[null,{"$f":"Calculation!C299+Calculation!L403","v":0},{"$f":"HLOOKUP(Main!$C$2,Translating_products!$CN$4:$DD$216,Translating_products!CM69, FALSE)","v":200035},{"$f":"HLOOKUP(Main!$C$2,Translating_products!$DI$4:$DY$216,Translating_products!CM69, FALSE)","v":"24V Power Supply (10A)"},{"$f":"IF(ISBLANK($Q$1),HLOOKUP(Main!$C$2,Translating_products!$EE$4:$EU$216,Translating_products!CM69,FALSE),HLOOKUP($Q$1,Translating_products!$EE$4:$EU$216,Translating_products!CM69,FALSE))","v":179},179,0,"Stück-Auswahl","Sonstiges",null,null,null,null,null,"nix",null,"$"]
[null,{"$f":"Calculation!C300","v":0},{"$f":"HLOOKUP(Main!$C$2,Translating_products!$CN$4:$DD$216,Translating_products!CM71, FALSE)","v":200040},{"$f":"IF(ISBLANK(Q1),HLOOKUP(Main!$C$2,Translating_products!$DI$4:$DY$216,Translating_products!CM71,FALSE),\"Not available in this country\")","v":"Surface Mount Box - IP20"},{"$f":"IF(ISBLANK($Q$1),HLOOKUP(Main!$C$2,Translating_products!$EE$4:$EU$216,Translating_products!CM71,FALSE),HLOOKUP($Q$1,Translating_products!$EE$4:$EU$216,Translating_products!CM71,FALSE))","v":10},10,0,"Stück-Auswahl","Sonstiges",null,null,null,null,null,"nix",null,"$"]
[null,{"$f":"Calculation!C80","v":0},{"$f":"HLOOKUP(Main!$C$2,Translating_products!$CN$4:$DD$216,Translating_products!CM72, FALSE)","v":200042},{"$f":"HLOOKUP(Main!$C$2,Translating_products!$DI$4:$DY$216,Translating_products!CM72, FALSE)","v":"RGB LED Strip 5m"},{"$f":"IF(ISBLANK($Q$1),HLOOKUP(Main!$C$2,Translating_products!$EE$4:$EU$216,Translating_products!CM72,FALSE),HLOOKUP($Q$1,Translating_products!$EE$4:$EU$216,Translating_products!CM72,FALSE))","v":109},109,0,"Stück-Auswahl Licht","Licht",null,null,null,null,null,{"$f":"14.4*5*B73","v":0},null,"$"]
[null,{"$f":"Calculation!C81","v":0},{"$f":"HLOOKUP(Main!$C$2,Translating_products!$CN$4:$DD$216,Translating_products!CM73, FALSE)","v":200043},{"$f":"HLOOKUP(Main!$C$2,Translating_products!$DI$4:$DY$216,Translating_products!CM73, FALSE)","v":"Warm White LED Strip 5m"},{"$f":"IF(ISBLANK($Q$1),HLOOKUP(Main!$C$2,Translating_products!$EE$4:$EU$216,Translating_products!CM73,FALSE),HLOOKUP($Q$1,Translating_products!$EE$4:$EU$216,Translating_products!CM73,FALSE))","v":109},109,0,"Stück-Auswahl Licht","Licht",null,null,null,null,null,0,null,"$"]
[null,{"$f":"Calculation!C83","v":0},{"$f":"HLOOKUP(Main!$C$2,Translating_products!$CN$4:$DD$216,Translating_products!CM75, FALSE)","v":200046},{"$f":"HLOOKUP(Main!$C$2,Translating_products!$DI$4:$DY$216,Translating_products!CM75, FALSE)","v":"RGB LED Strip 5m IP68"},{"$f":"IF(ISBLANK($Q$1),HLOOKUP(Main!$C$2,Translating_products!$EE$4:$EU$216,Translating_products!CM75,FALSE),HLOOKUP($Q$1,Translating_products!$EE$4:$EU$216,Translating_products!CM75,FALSE))","v":122},122,0,"Stück-Auswahl Licht","Licht",null,null,null,null,null,0,null,"$"]
[null,{"$f":"Calculation!C233","v":0},{"$f":"HLOOKUP(Main!$C$2,Translating_products!$CN$4:$DD$216,Translating_products!CM76, FALSE)","v":200048},{"$f":"HLOOKUP(Main!$C$2,Translating_products!$DI$4:$DY$216,Translating_products!CM76, FALSE)","v":"SMA Antenna 868 MHz"},{"$f":"IF(ISBLANK($Q$1),HLOOKUP(Main!$C$2,Translating_products!$EE$4:$EU$216,Translating_products!CM76,FALSE),HLOOKUP($Q$1,Translating_products!$EE$4:$EU$216,Translating_products!CM76,FALSE))","v":19},19,0,"Stück-Auswahl","Air",null,null,null,null,null,"nix",null,"$"]
[null,{"$f":"Calculation!C301+Calculation!C218","v":0},{"$f":"HLOOKUP(Main!$C$2,Translating_products!$CN$4:$DD$216,Translating_products!CM77, FALSE)","v":200049},{"$f":"HLOOKUP(Main!$C$2,Translating_products!$DI$4:$DY$216,Translating_products!CM77, FALSE)","v":"Coupling Relay"},{"$f":"IF(ISBLANK($Q$1),HLOOKUP(Main!$C$2,Translating_products!$EE$4:$EU$216,Translating_products!CM77,FALSE),HLOOKUP($Q$1,Translating_products!$EE$4:$EU$216,Translating_products!CM77,FALSE))","v":23},23,0,"Stück-Auswahl","Sonstiges",null,null,null,null,null,"nix",null,"$"]
[null,{"$f":"Calculation!C328","v":0},{"$f":"HLOOKUP(Main!$C$2,Translating_products!$CN$4:$DD$216,Translating_products!CM78, FALSE)","v":200050},{"$f":"HLOOKUP(Main!$C$2,Translating_products!$DI$4:$DY$216,Translating_products!CM78, FALSE)","v":"Loxone Sticker"},{"$f":"IF(ISBLANK($Q$1),HLOOKUP(Main!$C$2,Translating_products!$EE$4:$EU$216,Translating_products!CM78,FALSE),HLOOKUP($Q$1,Translating_products!$EE$4:$EU$216,Translating_products!CM78,FALSE))","v":5},5,0,"Stück-Auswahl Sonstiges","Sonstiges",null,null,null,null,null,"nix",null,"$"]
[null,{"$f":"Calculation!C177","v":0},{"$f":"HLOOKUP(Main!$C$2,Translating_products!$CN$4:$DD$216,Translating_products!CM79, FALSE)","v":200054},{"$f":"HLOOKUP(Main!$C$2,Translating_products!$DI$4:$DY$216,Translating_products!CM79, FALSE)","v":"Ultrasonic Sensor 0-10V"},{"$f":"IF(ISBLANK($Q$1),HLOOKUP(Main!$C$2,Translating_products!$EE$4:$EU$216,Translating_products!CM79,FALSE),HLOOKUP($Q$1,Translating_products!$EE$4:$EU$216,Translating_products!CM79,FALSE))","v":289},289,0,null,"Sensoren",1.0,null,null,null,null,{"$f":"B79*0.06","v":0},null,"$"]
[null,{"$f":"Calculation!C363","v":0},{"$f":"HLOOKUP(Main!$C$2,Translating_products!$CN$4:$DD$216,Translating_products!CM80, FALSE)","v":"not available in this country"},{"$f":"IF(ISBLANK(Q1),HLOOKUP(Main!$C$2,Translating_products!$DI$4:$DY$216,Translating_products!CM80,FALSE),\"Not available in this country\")","v":"not available in this country"},{"$f":"IF(ISBLANK($Q$1),HLOOKUP(Main!$C$2,Translating_products!$EE$4:$EU$216,Translating_products!CM80,FALSE),HLOOKUP($Q$1,Translating_products!$EE$4:$EU$216,Translating_products!CM80,FALSE))","v":0},0,0,"enocean - extension 1 kanal","Taster",null,null,null,null,1.0,"nix",null,"$"]
[null,{"$f":"Calculation!C234","v":0},{"$f":"HLOOKUP(Main!$C$2,Translating_products!$CN$4:$DD$216,Translating_products!CM81, FALSE)","v":"not available in this country"},{"$f":"IF(ISBLANK(Q1),HLOOKUP(Main!$C$2,Translating_products!$DI$4:$DY$216,Translating_products!CM81,FALSE),\"Not available in this country\")","v":"not available in this country"},{"$f":"IF(ISBLANK($Q$1),HLOOKUP(Main!$C$2,Translating_products!$EE$4:$EU$216,Translating_products!CM81,FALSE),HLOOKUP($Q$1,Translating_products!$EE$4:$EU$216,Translating_products!CM81,FALSE))","v":0},0,0,"Stück-Auswahl","Air",null,null,null,null,1.0,"nix",null,"$"]
[null,{"$f":"Calculation!C84","v":0},{"$f":"HLOOKUP(Main!$C$2,Translating_products!$CN$4:$DD$216,Translating_products!CM82, FALSE)","v":200061},{"$f":"HLOOKUP(Main!$C$2,Translating_products!$DI$4:$DY$216,Translating_products!CM82, FALSE)","v":"Warm White LED Strip 5m IP65"},{"$f":"IF(ISBLANK($Q$1),HLOOKUP(Main!$C$2,Translating_products!$EE$4:$EU$216,Translating_products!CM82,FALSE),HLOOKUP($Q$1,Translating_products!$EE$4:$EU$216,Translating_products!CM82,FALSE))","v":115},115,0,"Stück-Auswahl","Licht",null,null,null,null,null,{"$f":"14.4*5*B82","v":0},null,"$"]
[null,{"$f":"Calculation!C150","v":0},{"$f":"HLOOKUP(Main!$C$2,Translating_products!$CN$4:$DD$216,Translating_products!CM83, FALSE)","v":200063},{"$f":"HLOOKUP(Main!$C$2,Translating_products!$DI$4:$DY$216,Translating_products!CM83, FALSE)","v":"iButton Reader 1-Wire"},{"$f":"IF(ISBLANK($Q$1),HLOOKUP(Main!$C$2,Translating_products!$EE$4:$EU$216,Translating_products!CM83,FALSE),HLOOKUP($Q$1,Translating_products!$EE$4:$EU$216,Translating_products!CM83,FALSE))","v":13},13,0,"belegt 1 kanal von 1 Wire (Temparatur und Zutritt)","Zutritt",null,null,null,null,1.0,"nix",null,"$"]
[null,{"$f":"Calculation!C151","v":0},{"$f":"HLOOKUP(Main!$C$2,Translating_products!$CN$4:$DD$216,Translating_products!CM84, FALSE)","v":200064},{"$f":"HLOOKUP(Main!$C$2,Translating_products!$DI$4:$DY$216,Translating_products!CM84, FALSE)","v":"iButton Electronic Key Fob"},{"$f":"IF(ISBLANK($Q$1),HLOOKUP(Main!$C$2,Translating_products!$EE$4:$EU$216,Translating_products!CM84,FALSE),HLOOKUP($Q$1,Translating_products!$EE$4:$EU$216,Translating_products!CM84,FALSE))","v":5},5,0,"Stück-Zutritt","Zutritt",null,null,null,null,null,"nix",null,"$"]
[null,{"$f":"Calculation!C235","v":0},{"$f":"HLOOKUP(Main!$C$2,Translating_products!$CN$4:$DD$216,Translating_products!CM85, FALSE)","v":"not available in this country"},{"$f":"IF(ISBLANK(Q1),HLOOKUP(Main!$C$2,Translating_products!$DI$4:$DY$216,Translating_products!CM85,FALSE),\"Not available in this country\")","v":"not available in this country"},{"$f":"IF(ISBLANK($Q$1),HLOOKUP(Main!$C$2,Translating_products!$EE$4:$EU$216,Translating_products!CM85,FALSE),HLOOKUP($Q$1,Translating_products!$EE$4:$EU$216,Translating_products!CM85,FALSE))","v":0},0,0,"belegt 1 kanal enocean extension","Air",null,null,null,null,1.0,"nix",null,"$"]
[null,{"$f":"Calculation!C152","v":0},{"$f":"HLOOKUP(Main!$C$2,Translating_products!$CN$4:$DD$216,Translating_products!CM86, FALSE)","v":"not available in this country"},{"$f":"HLOOKUP(Main!$C$2,Translating_products!$DI$4:$DY$216,Translating_products!CM86, FALSE)","v":"not available in this country"},{"$f":"IF(ISBLANK($Q$1),HLOOKUP(Main!$C$2,Translating_products!$EE$4:$EU$216,Translating_products!CM86,FALSE),HLOOKUP($Q$1,Translating_products!$EE$4:$EU$216,Translating_products!CM86,FALSE))","v":0},0,0,"Stück-Auswahl Zutritt","Zutritt",null,null,null,null,null,"nix",null,"$"]
[null,{"$f":"Calculation!C138+Calculation!C178","v":0},{"$f":"HLOOKUP(Main!$C$2,Translating_products!$CN$4:$DD$216,Translating_products!CM87, FALSE)","v":200077},{"$f":"HLOOKUP(Main!$C$2,Translating_products!$DI$4:$DY$216,Translating_products!CM87, FALSE)","v":"Temperature Probe 1-Wire"},{"$f":"IF(ISBLANK($Q$1),HLOOKUP(Main!$C$2,Translating_products!$EE$4:$EU$216,Translating_products!CM87,FALSE),HLOOKUP($Q$1,Translating_products!$EE$4:$EU$216,Translating_products!CM87,FALSE))","v":15.5},15.5,0,"1-Wire Extension 1 Kanal","Sensoren",null,null,null,null,1.0,"nix",null,"$"]
[null,{"$f":"Calculation!C329","v":0},{"$f":"HLOOKUP(Main!$C$2,Translating_products!$CN$4:$DD$216,Translating_products!CM88, FALSE)","v":200086},{"$f":"HLOOKUP(Main!$C$2,Translating_products!$DI$4:$DY$216,Translating_products!CM88, FALSE)","v":"Fanshirt S"},{"$f":"IF(ISBLANK($Q$1),HLOOKUP(Main!$C$2,Translating_products!$EE$4:$EU$216,Translating_products!CM88,FALSE),HLOOKUP($Q$1,Translating_products!$EE$4:$EU$216,Translating_products!CM88,FALSE))","v":19},19,0,"Stück-Auswahl Sonstiges","Sonstiges",null,null,null,null,null,"nix",null,"$"]
[null,{"$f":"Calculation!C330","v":0},{"$f":"HLOOKUP(Main!$C$2,Translating_products!$CN$4:$DD$216,Translating_products!CM89, FALSE)","v":200087},{"$f":"HLOOKUP(Main!$C$2,Translating_products!$DI$4:$DY$216,Translating_products!CM89, FALSE)","v":"Fanshirt M"},{"$f":"IF(ISBLANK($Q$1),HLOOKUP(Main!$C$2,Translating_products!$EE$4:$EU$216,Translating_products!CM89,FALSE),HLOOKUP($Q$1,Translating_products!$EE$4:$EU$216,Translating_products!CM89,FALSE))","v":19},19,0,"Stück-Auswahl Sonstiges","Sonstiges",null,null,null,null,null,"nix",null,"$"]
[null,{"$f":"Calculation!C331","v":0},{"$f":"HLOOKUP(Main!$C$2,Translating_products!$CN$4:$DD$216,Translating_products!CM90, FALSE)","v":200088},{"$f":"HLOOKUP(Main!$C$2,Translating_products!$DI$4:$DY$216,Translating_products!CM90, FALSE)","v":"Fanshirt L"},{"$f":"IF(ISBLANK($Q$1),HLOOKUP(Main!$C$2,Translating_products!$EE$4:$EU$216,Translating_products!CM90,FALSE),HLOOKUP($Q$1,Translating_products!$EE$4:$EU$216,Translating_products!CM90,FALSE))","v":19},19,0,"Stück-Auswahl Sonstiges","Sonstiges",null,null,null,null,null,"nix",null,"$"]
[null,{"$f":"Calculation!C332","v":0},{"$f":"HLOOKUP(Main!$C$2,Translating_products!$CN$4:$DD$216,Translating_products!CM91, FALSE)","v":200089},{"$f":"HLOOKUP(Main!$C$2,Translating_products!$DI$4:$DY$216,Translating_products!CM91, FALSE)","v":"Fanshirt XL"},{"$f":"IF(ISBLANK($Q$1),HLOOKUP(Main!$C$2,Translating_products!$EE$4:$EU$216,Translating_products!CM91,FALSE),HLOOKUP($Q$1,Translating_products!$EE$4:$EU$216,Translating_products!CM91,FALSE))","v":19},19,0,"Stück-Auswahl Sonstiges","Sonstiges",null,null,null,null,null,"nix",null,"$"]
[null,{"$f":"Calculation!C333","v":0},{"$f":"HLOOKUP(Main!$C$2,Translating_products!$CN$4:$DD$216,Translating_products!CM92, FALSE)","v":200090},{"$f":"HLOOKUP(Main!$C$2,Translating_products!$DI$4:$DY$216,Translating_products!CM92, FALSE)","v":"Fanshirt XXL"},{"$f":"IF(ISBLANK($Q$1),HLOOKUP(Main!$C$2,Translating_products!$EE$4:$EU$216,Translating_products!CM92,FALSE),HLOOKUP($Q$1,Translating_products!$EE$4:$EU$216,Translating_products!CM92,FALSE))","v":19},19,0,"Stück-Auswahl Sonstiges","Sonstiges",null,null,null,null,null,"nix",null,"$"]
[null,{"$f":"Calculation!C85","v":0},{"$f":"HLOOKUP(Main!$C$2,Translating_products!$CN$4:$DD$216,Translating_products!CM93, FALSE)","v":200092},{"$f":"HLOOKUP(Main!$C$2,Translating_products!$DI$4:$DY$216,Translating_products!CM93, FALSE)","v":"Warm White LED Strip 5m IP68"},{"$f":"IF(ISBLANK($Q$1),HLOOKUP(Main!$C$2,Translating_products!$EE$4:$EU$216,Translating_products!CM93,FALSE),HLOOKUP($Q$1,Translating_products!$EE$4:$EU$216,Translating_products!CM93,FALSE))","v":115},115,0,"Stück-Auswahl","Licht",null,null,null,null,null,{"$f":"14.4*5*B93","v":0},null,"$"]
[null,{"$f":"Calculation!C155","v":0},{"$f":"HLOOKUP(Main!$C$2,Translating_products!$CN$4:$DD$216,Translating_products!CM94, FALSE)","v":200103},{"$f":"HLOOKUP(Main!$C$2,Translating_products!$DI$4:$DY$216,Translating_products!CM94, FALSE)","v":"Loxone Intercom"},{"$f":"IF(ISBLANK($Q$1),HLOOKUP(Main!$C$2,Translating_products!$EE$4:$EU$216,Translating_products!CM94,FALSE),HLOOKUP($Q$1,Translating_products!$EE$4:$EU$216,Translating_products!CM94,FALSE))","v":1149},1149,0,"Stück-Auswähl Zutritt","Zutritt",null,null,null,null,null,"nix",null,"$"]
[null,{"$f":"Calculation!C156","v":0},{"$f":"HLOOKUP(Main!$C$2,Translating_products!$CN$4:$DD$216,Translating_products!CM95, FALSE)","v":200094},{"$f":"HLOOKUP(Main!$C$2,Translating_products!$DI$4:$DY$216,Translating_products!CM95, FALSE)","v":"Flush-mounted box for the Loxone intercom"},{"$f":"IF(ISBLANK($Q$1),HLOOKUP(Main!$C$2,Translating_products!$EE$4:$EU$216,Translating_products!CM95,FALSE),HLOOKUP($Q$1,Translating_products!$EE$4:$EU$216,Translating_products!CM95,FALSE))","v":70},70,0,"Stück-Auswähl Zutritt","Zutritt",null,null,null,null,null,"nix",null,"$"]
[null,{"$f":"Calculation!C157","v":0},{"$f":"HLOOKUP(Main!$C$2,Translating_products!$CN$4:$DD$216,Translating_products!CM96, FALSE)","v":200095},{"$f":"HLOOKUP(Main!$C$2,Translating_products!$DI$4:$DY$216,Translating_products!CM96, FALSE)","v":"Surface Box for Loxone Intercom"},{"$f":"IF(ISBLANK($Q$1),HLOOKUP(Main!$C$2,Translating_products!$EE$4:$EU$216,Translating_products!CM96,FALSE),HLOOKUP($Q$1,Translating_products!$EE$4:$EU$216,Translating_products!CM96,FALSE))","v":130},130,0,"Stück-Auswähl Zutritt","Zutritt",null,null,null,null,null,"nix",null,"$"]
[null,{"$f":"Calculation!C122","v":0},{"$f":"HLOOKUP(Main!$C$2,Translating_products!$CN$4:$DD$216,Translating_products!CM97, FALSE)","v":200097},{"$f":"HLOOKUP(Main!$C$2,Translating_products!$DI$4:$DY$216,Translating_products!CM97, FALSE)","v":"Loxone Speaker"},{"$f":"IF(ISBLANK($Q$1),HLOOKUP(Main!$C$2,Translating_products!$EE$4:$EU$216,Translating_products!CM97,FALSE),HLOOKUP($Q$1,Translating_products!$EE$4:$EU$216,Translating_products!CM97,FALSE))","v":117},117,0,"Stück-Auswahl Musik (1 Kanal am Musikserver)","Musik",null,null,null,null,1.0,"nix",null,"$"]
[null,{"$f":"Calculation!C86","v":0},{"$f":"HLOOKUP(Main!$C$2,Translating_products!$CN$4:$DD$216,Translating_products!CM98, FALSE)","v":200098},{"$f":"HLOOKUP(Main!$C$2,Translating_products!$DI$4:$DY$216,Translating_products!CM98, FALSE)","v":"RGBW LED Strip 5m IP20"},{"$f":"IF(ISBLANK($Q$1),HLOOKUP(Main!$C$2,Translating_products!$EE$4:$EU$216,Translating_products!CM98,FALSE),HLOOKUP($Q$1,Translating_products!$EE$4:$EU$216,Translating_products!CM98,FALSE))","v":149},149,0,"Stück-Auswahl Licht","Licht",null,null,null,null,null,{"$f":"B98*4.2","v":0},null,"$"]
[null,{"$f":"Calculation!C87","v":0},{"$f":"HLOOKUP(Main!$C$2,Translating_products!$CN$4:$DD$216,Translating_products!CM99, FALSE)","v":200099},{"$f":"HLOOKUP(Main!$C$2,Translating_products!$DI$4:$DY$216,Translating_products!CM99, FALSE)","v":"RGBW LED Strip 5m IP65"},{"$f":"IF(ISBLANK($Q$1),HLOOKUP(Main!$C$2,Translating_products!$EE$4:$EU$216,Translating_products!CM99,FALSE),HLOOKUP($Q$1,Translating_products!$EE$4:$EU$216,Translating_products!CM99,FALSE))","v":156},156,0,"Stück-Auswahl Licht","Licht",null,null,null,null,null,0,null,"$"]
[null,{"$f":"Calculation!C88","v":0},{"$f":"HLOOKUP(Main!$C$2,Translating_products!$CN$4:$DD$216,Translating_products!CM100, FALSE)","v":200100},{"$f":"HLOOKUP(Main!$C$2,Translating_products!$DI$4:$DY$216,Translating_products!CM100, FALSE)","v":"RGBW LED Strip 5m IP68"},{"$f":"IF(ISBLANK($Q$1),HLOOKUP(Main!$C$2,Translating_products!$EE$4:$EU$216,Translating_products!CM100,FALSE),HLOOKUP($Q$1,Translating_products!$EE$4:$EU$216,Translating_products!CM100,FALSE))","v":164},164,0,"Stück-Auswahl Licht","Licht",null,null,null,null,null,0,null,"$"]
[null,{"$f":"Calculation!C179","v":0},{"$f":"HLOOKUP(Main!$C$2,Translating_products!$CN$4:$DD$216,Translating_products!CM101, FALSE)","v":200101},{"$f":"HLOOKUP(Main!$C$2,Translating_products!$DI$4:$DY$216,Translating_products!CM101, FALSE)","v":"Water Sensor"},{"$f":"IF(ISBLANK($Q$1),HLOOKUP(Main!$C$2,Translating_products!$EE$4:$EU$216,Translating_products!CM101,FALSE),HLOOKUP($Q$1,Translating_products!$EE$4:$EU$216,Translating_products!CM101,FALSE))","v":23},23,0,"Sensoren","Sensoren",null,1.0,null,null,null,"nix",null,"$"]
[null,{"$f":"Calculation!C302","v":0},{"$f":"HLOOKUP(Main!$C$2,Translating_products!$CN$4:$DD$216,Translating_products!CM102, FALSE)","v":"not available in this country"},{"$f":"IF(ISBLANK(Q1),HLOOKUP(Main!$C$2,Translating_products!$DI$4:$DY$216,Translating_products!CM102,FALSE),\"Not available in this country\")","v":"not available in this country"},{"$f":"IF(ISBLANK($Q$1),HLOOKUP(Main!$C$2,Translating_products!$EE$4:$EU$216,Translating_products!CM102,FALSE),HLOOKUP($Q$1,Translating_products!$EE$4:$EU$216,Translating_products!CM102,FALSE))","v":0},0,0,"Stück-Auswahl","Sonstiges",null,null,null,null,null,"nix",null,"$"]
[null,{"$f":"Calculation!C139+Calculation!C180","v":0},{"$f":"HLOOKUP(Main!$C$2,Translating_products!$CN$4:$DD$216,Translating_products!CM103, FALSE)","v":200109},{"$f":"HLOOKUP(Main!$C$2,Translating_products!$DI$4:$DY$216,Translating_products!CM103, FALSE)","v":"Temperature Sensor Set 1-Wire"},{"$f":"IF(ISBLANK($Q$1),HLOOKUP(Main!$C$2,Translating_products!$EE$4:$EU$216,Translating_products!CM103,FALSE),HLOOKUP($Q$1,Translating_products!$EE$4:$EU$216,Translating_products!CM103,FALSE))","v":53.9},53.9,0,"5 Temparaturfühler (11 in der Auswahl = 3 mal Paket (15))","Heizung",null,null,null,null,5.0,"nix",null,"$"]
[null,{"$f":"Calculation!C123","v":0},{"$f":"HLOOKUP(Main!$C$2,Translating_products!$CN$4:$DD$216,Translating_products!CM104, FALSE)","v":200110},{"$f":"HLOOKUP(Main!$C$2,Translating_products!$DI$4:$DY$216,Translating_products!CM104, FALSE)","v":"Loxone 12 Channel Amplifier"},{"$f":"IF(ISBLANK($Q$1),HLOOKUP(Main!$C$2,Translating_products!$EE$4:$EU$216,Translating_products!CM104,FALSE),HLOOKUP($Q$1,Translating_products!$EE$4:$EU$216,Translating_products!CM104,FALSE))","v":999},999,0,"Stück-Auswahl Musik","Musik",null,null,null,null,null,"nix",null,"$"]
[null,{"$f":"Calculation!C181","v":0},{"$f":"HLOOKUP(Main!$C$2,Translating_products!$CN$4:$DD$216,Translating_products!CM105, FALSE)","v":200112},{"$f":"HLOOKUP(Main!$C$2,Translating_products!$DI$4:$DY$216,Translating_products!CM105, FALSE)","v":"Outside Motion Sensor (24V)"},{"$f":"IF(ISBLANK($Q$1),HLOOKUP(Main!$C$2,Translating_products!$EE$4:$EU$216,Translating_products!CM105,FALSE),HLOOKUP($Q$1,Translating_products!$EE$4:$EU$216,Translating_products!CM105,FALSE))","v":135},135,0,null,"Sensoren",null,1.0,null,null,null,{"$f":"B105*0.0033","v":0},null,"$"]
[null,{"$f":"Calculation!C183","v":0},{"$f":"HLOOKUP(Main!$C$2,Translating_products!$CN$4:$DD$216,Translating_products!CM106, FALSE)","v":200113},{"$f":"HLOOKUP(Main!$C$2,Translating_products!$DI$4:$DY$216,Translating_products!CM106, FALSE)","v":"Window & Door Contact"},{"$f":"IF(ISBLANK($Q$1),HLOOKUP(Main!$C$2,Translating_products!$EE$4:$EU$216,Translating_products!CM106,FALSE),HLOOKUP($Q$1,Translating_products!$EE$4:$EU$216,Translating_products!CM106,FALSE))","v":13.5},13.5,0,null,"Sensoren",null,1.0,null,null,null,"nix",null,"$"]
[null,{"$f":"Calculation!C215","v":0},{"$f":"HLOOKUP(Main!$C$2,Translating_products!$CN$4:$DD$216,Translating_products!CM107, FALSE)","v":200129},{"$f":"HLOOKUP(Main!$C$2,Translating_products!$DI$4:$DY$216,Translating_products!CM107, FALSE)","v":"Loxone Cat 7 Cable (820ft)"},{"$f":"IF(ISBLANK($Q$1),HLOOKUP(Main!$C$2,Translating_products!$EE$4:$EU$216,Translating_products!CM107,FALSE),HLOOKUP($Q$1,Translating_products!$EE$4:$EU$216,Translating_products!CM107,FALSE))","v":265},265,0,"Stück-Auswahl","Sonstiges",null,null,null,null,null,"nix",null,"$"]
[null,{"$f":"Calculation!C236","v":0},{"$f":"HLOOKUP(Main!$C$2,Translating_products!$CN$4:$DD$216,Translating_products!CM108, FALSE)","v":"not available in this country"},{"$f":"HLOOKUP(Main!$C$2,Translating_products!$DI$4:$DY$216,Translating_products!CM108, FALSE)","v":"not available in this country"},{"$f":"IF(ISBLANK($Q$1),HLOOKUP(Main!$C$2,Translating_products!$EE$4:$EU$216,Translating_products!CM108,FALSE),HLOOKUP($Q$1,Translating_products!$EE$4:$EU$216,Translating_products!CM108,FALSE))","v":0},0,0,"enocean - extension 1 kanal (für Licht und Temparatur)","Air",null,null,null,null,1.0,"nix",null,"$"]
[null,{"$f":"Calculation!C184","v":0},{"$f":"HLOOKUP(Main!$C$2,Translating_products!$CN$4:$DD$216,Translating_products!CM109, FALSE)","v":200136},{"$f":"HLOOKUP(Main!$C$2,Translating_products!$DI$4:$DY$216,Translating_products!CM109, FALSE)","v":"Temperature & Humidity Sensor For Saunas"},{"$f":"IF(ISBLANK($Q$1),HLOOKUP(Main!$C$2,Translating_products!$EE$4:$EU$216,Translating_products!CM109,FALSE),HLOOKUP($Q$1,Translating_products!$EE$4:$EU$216,Translating_products!CM109,FALSE))","v":205},205,0,null,"Sonstiges",2.0,null,null,null,null,{"$f":"0.01*B109","v":0},null,"$"]
[null,{"$f":"Calculation!C237","v":0},{"$f":"HLOOKUP(Main!$C$2,Translating_products!$CN$4:$DD$216,Translating_products!CM110, FALSE)","v":"not available in this country"},{"$f":"HLOOKUP(Main!$C$2,Translating_products!$DI$4:$DY$216,Translating_products!CM110, FALSE)","v":"not available in this country"},{"$f":"IF(ISBLANK($Q$1),HLOOKUP(Main!$C$2,Translating_products!$EE$4:$EU$216,Translating_products!CM110,FALSE),HLOOKUP($Q$1,Translating_products!$EE$4:$EU$216,Translating_products!CM110,FALSE))","v":0},0,0,"enocean - extension 1 kanal (für Licht und Temparatur)","Air",null,null,null,null,1.0,"nix",null,"$"]
[null,{"$f":"Calculation!C303+Calculation!L400","v":0},{"$f":"HLOOKUP(Main!$C$2,Translating_products!$CN$4:$DD$216,Translating_products!CM111, FALSE)","v":200143},{"$f":"HLOOKUP(Main!$C$2,Translating_products!$DI$4:$DY$216,Translating_products!CM111, FALSE)","v":"24V Power Supply (0.4A)"},{"$f":"IF(ISBLANK($Q$1),HLOOKUP(Main!$C$2,Translating_products!$EE$4:$EU$216,Translating_products!CM111,FALSE),HLOOKUP($Q$1,Translating_products!$EE$4:$EU$216,Translating_products!CM111,FALSE))","v":36},36,0,"Stück-Auswahl","Sonstiges",null,null,null,null,null,"nix",null,"$"]
[null,{"$f":"Calculation!C124","v":0},{"$f":"HLOOKUP(Main!$C$2,Translating_products!$CN$4:$DD$216,Translating_products!CM112, FALSE)","v":200150},{"$f":"HLOOKUP(Main!$C$2,Translating_products!$DI$4:$DY$216,Translating_products!CM112, FALSE)","v":"Loxone Speaker Back Box"},{"$f":"IF(ISBLANK($Q$1),HLOOKUP(Main!$C$2,Translating_products!$EE$4:$EU$216,Translating_products!CM112,FALSE),HLOOKUP($Q$1,Translating_products!$EE$4:$EU$216,Translating_products!CM112,FALSE))","v":58},58,0,"Stück-Auswahl Musik (wählt Kunde aus)","Musik",null,null,null,null,null,"nix",null,"$"]
[null,{"$f":"Calculation!C238","v":0},{"$f":"HLOOKUP(Main!$C$2,Translating_products!$CN$4:$DD$216,Translating_products!CM113, FALSE)","v":200151},{"$f":"HLOOKUP(Main!$C$2,Translating_products!$DI$4:$DY$216,Translating_products!CM113, FALSE)","v":"SMA Antenna 4dBi 868 MHz"},{"$f":"IF(ISBLANK($Q$1),HLOOKUP(Main!$C$2,Translating_products!$EE$4:$EU$216,Translating_products!CM113,FALSE),HLOOKUP($Q$1,Translating_products!$EE$4:$EU$216,Translating_products!CM113,FALSE))","v":29.9},29.9,0,"Stück-Auswahl Air","Air",null,null,null,null,null,"nix",null,"$"]
[null,{"$f":"Calculation!C127","v":0},{"$f":"HLOOKUP(Main!$C$2,Translating_products!$CN$4:$DD$216,Translating_products!CM114, FALSE)","v":200153},{"$f":"HLOOKUP(Main!$C$2,Translating_products!$DI$4:$DY$216,Translating_products!CM114, FALSE)","v":"Loxone Wall Speaker"},{"$f":"IF(ISBLANK($Q$1),HLOOKUP(Main!$C$2,Translating_products!$EE$4:$EU$216,Translating_products!CM114,FALSE),HLOOKUP($Q$1,Translating_products!$EE$4:$EU$216,Translating_products!CM114,FALSE))","v":149},149,0,"Stück-Auswahl Musik","Musik",null,null,null,null,null,"nix",null,"$"]
[null,{"$f":"Calculation!C185","v":0},{"$f":"HLOOKUP(Main!$C$2,Translating_products!$CN$4:$DD$216,Translating_products!CM115, FALSE)","v":200154},{"$f":"HLOOKUP(Main!$C$2,Translating_products!$DI$4:$DY$216,Translating_products!CM115, FALSE)","v":"Pressure Sensor 0-10V"},{"$f":"IF(ISBLANK($Q$1),HLOOKUP(Main!$C$2,Translating_products!$EE$4:$EU$216,Translating_products!CM115,FALSE),HLOOKUP($Q$1,Translating_products!$EE$4:$EU$216,Translating_products!CM115,FALSE))","v":115},115,0,null,"Sensoren",1.0,null,null,null,null,{"$f":"B115*0.01","v":0},null,"$"]
[null,{"$f":"Calculation!C186","v":0},{"$f":"HLOOKUP(Main!$C$2,Translating_products!$CN$4:$DD$216,Translating_products!CM116, FALSE)","v":200155},{"$f":"HLOOKUP(Main!$C$2,Translating_products!$DI$4:$DY$216,Translating_products!CM116, FALSE)","v":"Glass Break Sensor 24V"},{"$f":"IF(ISBLANK($Q$1),HLOOKUP(Main!$C$2,Translating_products!$EE$4:$EU$216,Translating_products!CM116,FALSE),HLOOKUP($Q$1,Translating_products!$EE$4:$EU$216,Translating_products!CM116,FALSE))","v":34},34,0,null,"Sensoren",null,1.0,null,null,null,"nix",null,"$"]
[null,{"$f":"Calculation!C304","v":0},{"$f":"HLOOKUP(Main!$C$2,Translating_products!$CN$4:$DD$216,Translating_products!CM117, FALSE)","v":"not available in this country"},{"$f":"HLOOKUP(Main!$C$2,Translating_products!$DI$4:$DY$216,Translating_products!CM117, FALSE)","v":"not available in this country"},{"$f":"IF(ISBLANK($Q$1),HLOOKUP(Main!$C$2,Translating_products!$EE$4:$EU$216,Translating_products!CM117,FALSE),HLOOKUP($Q$1,Translating_products!$EE$4:$EU$216,Translating_products!CM117,FALSE))","v":0},0,0,"selbst auswählen","Sonstiges",null,null,null,null,null,"nix",null,"$"]
[null,{"$f":"Calculation!C305","v":0},{"$f":"HLOOKUP(Main!$C$2,Translating_products!$CN$4:$DD$216,Translating_products!CM118, FALSE)","v":"not available in this country"},{"$f":"HLOOKUP(Main!$C$2,Translating_products!$DI$4:$DY$216,Translating_products!CM118, FALSE)","v":"not available in this country"},{"$f":"IF(ISBLANK($Q$1),HLOOKUP(Main!$C$2,Translating_products!$EE$4:$EU$216,Translating_products!CM118,FALSE),HLOOKUP($Q$1,Translating_products!$EE$4:$EU$216,Translating_products!CM118,FALSE))","v":0},0,0,"selbst auswählen","Sonstiges",null,null,null,null,null,"nix",null,"$"]
[null,{"$f":"Calculation!C334","v":0},{"$f":"HLOOKUP(Main!$C$2,Translating_products!$CN$4:$DD$216,Translating_products!CM119, FALSE)","v":"not available in this country"},{"$f":"HLOOKUP(Main!$C$2,Translating_products!$DI$4:$DY$216,Translating_products!CM119, FALSE)","v":"not available in this country"},{"$f":"IF(ISBLANK($Q$1),HLOOKUP(Main!$C$2,Translating_products!$EE$4:$EU$216,Translating_products!CM119,FALSE),HLOOKUP($Q$1,Translating_products!$EE$4:$EU$216,Translating_products!CM119,FALSE))","v":0},0,0,"buggy im shop","Sonstiges",null,null,null,null,null,"nix",null,"$"]
[null,{"$f":"Calculation!C199","v":0},{"$f":"HLOOKUP(Main!$C$2,Translating_products!$CN$4:$DD$216,Translating_products!CM120, FALSE)","v":200168},{"$f":"HLOOKUP(Main!$C$2,Translating_products!$DI$4:$DY$216,Translating_products!CM120, FALSE)","v":"Push In Terminal Block 8x4 Interconnected (20 pcs)"},{"$f":"IF(ISBLANK($Q$1),HLOOKUP(Main!$C$2,Translating_products!$EE$4:$EU$216,Translating_products!CM120,FALSE),HLOOKUP($Q$1,Translating_products!$EE$4:$EU$216,Translating_products!CM120,FALSE))","v":265},265,0,"Stück-Auswahl Verteiler","Verteiler",null,null,null,null,null,"nix",null,"$"]
[null,{"$f":"Calculation!C200","v":0},{"$f":"HLOOKUP(Main!$C$2,Translating_products!$CN$4:$DD$216,Translating_products!CM121, FALSE)","v":200169},{"$f":"HLOOKUP(Main!$C$2,Translating_products!$DI$4:$DY$216,Translating_products!CM121, FALSE)","v":"Push In Terminal Block 8x4 Seperated (20pcs)"},{"$f":"IF(ISBLANK($Q$1),HLOOKUP(Main!$C$2,Translating_products!$EE$4:$EU$216,Translating_products!CM121,FALSE),HLOOKUP($Q$1,Translating_products!$EE$4:$EU$216,Translating_products!CM121,FALSE))","v":249},249,0,"Stück-Auswahl Verteiler","Verteiler",null,null,null,null,null,"nix",null,"$"]
[null,{"$f":"Calculation!C201","v":0},{"$f":"HLOOKUP(Main!$C$2,Translating_products!$CN$4:$DD$216,Translating_products!CM122, FALSE)","v":200170},{"$f":"HLOOKUP(Main!$C$2,Translating_products!$DI$4:$DY$216,Translating_products!CM122, FALSE)","v":"Partition for 8x4 Terminals (10pcs)"},{"$f":"IF(ISBLANK($Q$1),HLOOKUP(Main!$C$2,Translating_products!$EE$4:$EU$216,Translating_products!CM122,FALSE),HLOOKUP($Q$1,Translating_products!$EE$4:$EU$216,Translating_products!CM122,FALSE))","v":14},14,0,"Stück-Auswahl Verteiler","Verteiler",null,null,null,null,null,"nix",null,"$"]
[null,{"$f":"Calculation!C202","v":0},{"$f":"HLOOKUP(Main!$C$2,Translating_products!$CN$4:$DD$216,Translating_products!CM123, FALSE)","v":200171},{"$f":"HLOOKUP(Main!$C$2,Translating_products!$DI$4:$DY$216,Translating_products!CM123, FALSE)","v":"Label Holder 8 Levels (20 pcs)"},{"$f":"IF(ISBLANK($Q$1),HLOOKUP(Main!$C$2,Translating_products!$EE$4:$EU$216,Translating_products!CM123,FALSE),HLOOKUP($Q$1,Translating_products!$EE$4:$EU$216,Translating_products!CM123,FALSE))","v":34},34,0,"Stück-Auswahl Verteiler","Verteiler",null,null,null,null,null,"nix",null,"$"]
[null,{"$f":"Calculation!C203","v":0},{"$f":"HLOOKUP(Main!$C$2,Translating_products!$CN$4:$DD$216,Translating_products!CM124, FALSE)","v":200172},{"$f":"HLOOKUP(Main!$C$2,Translating_products!$DI$4:$DY$216,Translating_products!CM124, FALSE)","v":"End Plate for 8x4 Terminals (10 pcs)"},{"$f":"IF(ISBLANK($Q$1),HLOOKUP(Main!$C$2,Translating_products!$EE$4:$EU$216,Translating_products!CM124,FALSE),HLOOKUP($Q$1,Translating_products!$EE$4:$EU$216,Translating_products!CM124,FALSE))","v":7},7,0,"Stück-Auswahl Verteiler","Verteiler",null,null,null,null,null,"nix",null,"$"]
[null,{"$f":"Calculation!C204","v":0},{"$f":"HLOOKUP(Main!$C$2,Translating_products!$CN$4:$DD$216,Translating_products!CM125, FALSE)","v":200173},{"$f":"HLOOKUP(Main!$C$2,Translating_products!$DI$4:$DY$216,Translating_products!CM125, FALSE)","v":"Push In Terminal Block 3+Earth (50 pcs)"},{"$f":"IF(ISBLANK($Q$1),HLOOKUP(Main!$C$2,Translating_products!$EE$4:$EU$216,Translating_products!CM125,FALSE),HLOOKUP($Q$1,Translating_products!$EE$4:$EU$216,Translating_products!CM125,FALSE))","v":259},259,0,"Stück-Auswahl Verteiler","Verteiler",null,null,null,null,null,"nix",null,"$"]
[null,{"$f":"Calculation!C205","v":0},{"$f":"HLOOKUP(Main!$C$2,Translating_products!$CN$4:$DD$216,Translating_products!CM126, FALSE)","v":200174},{"$f":"HLOOKUP(Main!$C$2,Translating_products!$DI$4:$DY$216,Translating_products!CM126, FALSE)","v":"End Plate for 3+Earth Terminals (20 pcs)"},{"$f":"IF(ISBLANK($Q$1),HLOOKUP(Main!$C$2,Translating_products!$EE$4:$EU$216,Translating_products!CM126,FALSE),HLOOKUP($Q$1,Translating_products!$EE$4:$EU$216,Translating_products!CM126,FALSE))","v":14},14,0,"Stück-Auswahl Verteiler","Verteiler",null,null,null,null,null,"nix",null,"$"]
[null,{"$f":"Calculation!C206","v":0},{"$f":"HLOOKUP(Main!$C$2,Translating_products!$CN$4:$DD$216,Translating_products!CM127, FALSE)","v":200175},{"$f":"HLOOKUP(Main!$C$2,Translating_products!$DI$4:$DY$216,Translating_products!CM127, FALSE)","v":"Push In Terminal Block Twin+Earth (50 pcs)"},{"$f":"IF(ISBLANK($Q$1),HLOOKUP(Main!$C$2,Translating_products!$EE$4:$EU$216,Translating_products!CM127,FALSE),HLOOKUP($Q$1,Translating_products!$EE$4:$EU$216,Translating_products!CM127,FALSE))","v":141.5},141.5,0,"Stück-Auswahl Verteiler","Verteiler",null,null,null,null,null,"nix",null,"$"]
[null,{"$f":"Calculation!C207","v":0},{"$f":"HLOOKUP(Main!$C$2,Translating_products!$CN$4:$DD$216,Translating_products!CM128, FALSE)","v":200176},{"$f":"HLOOKUP(Main!$C$2,Translating_products!$DI$4:$DY$216,Translating_products!CM128, FALSE)","v":"End Plate for Twin+Earth Terminals (20 pcs)"},{"$f":"IF(ISBLANK($Q$1),HLOOKUP(Main!$C$2,Translating_products!$EE$4:$EU$216,Translating_products!CM128,FALSE),HLOOKUP($Q$1,Translating_products!$EE$4:$EU$216,Translating_products!CM128,FALSE))","v":10},10,0,"Stück-Auswahl Verteiler","Verteiler",null,null,null,null,null,"nix",null,"$"]
[null,{"$f":"Calculation!C208","v":0},{"$f":"HLOOKUP(Main!$C$2,Translating_products!$CN$4:$DD$216,Translating_products!CM129, FALSE)","v":200177},{"$f":"HLOOKUP(Main!$C$2,Translating_products!$DI$4:$DY$216,Translating_products!CM129, FALSE)","v":"End Bracket (20 pcs)"},{"$f":"IF(ISBLANK($Q$1),HLOOKUP(Main!$C$2,Translating_products!$EE$4:$EU$216,Translating_products!CM129,FALSE),HLOOKUP($Q$1,Translating_products!$EE$4:$EU$216,Translating_products!CM129,FALSE))","v":10},10,0,"Stück-Auswahl Verteiler","Verteiler",null,null,null,null,null,"nix",null,"$"]
[null,{"$f":"Calculation!C209","v":0},{"$f":"HLOOKUP(Main!$C$2,Translating_products!$CN$4:$DD$216,Translating_products!CM130, FALSE)","v":200178},{"$f":"HLOOKUP(Main!$C$2,Translating_products!$DI$4:$DY$216,Translating_products!CM130, FALSE)","v":"Push in Fused Terminal Block (25 pcs)"},{"$f":"IF(ISBLANK($Q$1),HLOOKUP(Main!$C$2,Translating_products!$EE$4:$EU$216,Translating_products!CM130,FALSE),HLOOKUP($Q$1,Translating_products!$EE$4:$EU$216,Translating_products!CM130,FALSE))","v":159},159,0,"Stück-Auswahl Verteiler","Verteiler",null,null,null,null,null,"nix",null,"$"]
[null,{"$f":"Calculation!C210","v":0},{"$f":"HLOOKUP(Main!$C$2,Translating_products!$CN$4:$DD$216,Translating_products!CM131, FALSE)","v":200179},{"$f":"HLOOKUP(Main!$C$2,Translating_products!$DI$4:$DY$216,Translating_products!CM131, FALSE)","v":"End Plate For Fused Terminals (50 pcs)"},{"$f":"IF(ISBLANK($Q$1),HLOOKUP(Main!$C$2,Translating_products!$EE$4:$EU$216,Translating_products!CM131,FALSE),HLOOKUP($Q$1,Translating_products!$EE$4:$EU$216,Translating_products!CM131,FALSE))","v":22},22,0,"Stück-Auswahl Verteiler","Verteiler",null,null,null,null,null,"nix",null,"$"]
[null,{"$f":"Calculation!C211","v":0},{"$f":"HLOOKUP(Main!$C$2,Translating_products!$CN$4:$DD$216,Translating_products!CM132, FALSE)","v":200180},{"$f":"HLOOKUP(Main!$C$2,Translating_products!$DI$4:$DY$216,Translating_products!CM132, FALSE)","v":"Cross Connector For Fused Terminals (10 pcs)"},{"$f":"IF(ISBLANK($Q$1),HLOOKUP(Main!$C$2,Translating_products!$EE$4:$EU$216,Translating_products!CM132,FALSE),HLOOKUP($Q$1,Translating_products!$EE$4:$EU$216,Translating_products!CM132,FALSE))","v":79},79,0,"Stück-Auswahl Verteiler","Verteiler",null,null,null,null,null,"nix",null,"$"]
[null,{"$f":"Calculation!C212","v":0},{"$f":"HLOOKUP(Main!$C$2,Translating_products!$CN$4:$DD$216,Translating_products!CM133, FALSE)","v":200181},{"$f":"HLOOKUP(Main!$C$2,Translating_products!$DI$4:$DY$216,Translating_products!CM133, FALSE)","v":"Blade Fuse 2A (100 pcs)"},{"$f":"IF(ISBLANK($Q$1),HLOOKUP(Main!$C$2,Translating_products!$EE$4:$EU$216,Translating_products!CM133,FALSE),HLOOKUP($Q$1,Translating_products!$EE$4:$EU$216,Translating_products!CM133,FALSE))","v":13},13,0,"Stück-Auswahl Verteiler","Verteiler",null,null,null,null,null,"nix",null,"$"]
[null,{"$f":"Calculation!C213","v":0},{"$f":"HLOOKUP(Main!$C$2,Translating_products!$CN$4:$DD$216,Translating_products!CM134, FALSE)","v":200183},{"$f":"HLOOKUP(Main!$C$2,Translating_products!$DI$4:$DY$216,Translating_products!CM134, FALSE)","v":"Blade Fuse 5A (100 pcs)"},{"$f":"IF(ISBLANK($Q$1),HLOOKUP(Main!$C$2,Translating_products!$EE$4:$EU$216,Translating_products!CM134,FALSE),HLOOKUP($Q$1,Translating_products!$EE$4:$EU$216,Translating_products!CM134,FALSE))","v":13},13,0,"Stück-Auswahl Verteiler","Verteiler",null,null,null,null,null,"nix",null,"$"]
[null,{"$f":"Calculation!C214","v":0},{"$f":"HLOOKUP(Main!$C$2,Translating_products!$CN$4:$DD$216,Translating_products!CM135, FALSE)","v":200184},{"$f":"HLOOKUP(Main!$C$2,Translating_products!$DI$4:$DY$216,Translating_products!CM135, FALSE)","v":"Blade Fuse 10A (100 pcs)"},{"$f":"IF(ISBLANK($Q$1),HLOOKUP(Main!$C$2,Translating_products!$EE$4:$EU$216,Translating_products!CM135,FALSE),HLOOKUP($Q$1,Translating_products!$EE$4:$EU$216,Translating_products!CM135,FALSE))","v":13},13,0,"Stück-Auswahl Verteiler","Verteiler",null,null,null,null,null,"nix",null,"$"]
[null,{"$f":"Calculation!C335","v":0},{"$f":"HLOOKUP(Main!$C$2,Translating_products!$CN$4:$DD$216,Translating_products!CM136, FALSE)","v":200186},{"$f":"HLOOKUP(Main!$C$2,Translating_products!$DI$4:$DY$216,Translating_products!CM136, FALSE)","v":"Loxone Brochure (25 pcs)"},{"$f":"IF(ISBLANK($Q$1),HLOOKUP(Main!$C$2,Translating_products!$EE$4:$EU$216,Translating_products!CM136,FALSE),HLOOKUP($Q$1,Translating_products!$EE$4:$EU$216,Translating_products!CM136,FALSE))","v":5},5,0,"Stück-Auswahl Sonstiges","Sonstiges",null,null,null,null,null,"nix",null,"$"]
[null,{"$f":"Calculation!C158","v":0},{"$f":"HLOOKUP(Main!$C$2,Translating_products!$CN$4:$DD$216,Translating_products!CM137, FALSE)","v":200191},{"$f":"HLOOKUP(Main!$C$2,Translating_products!$DI$4:$DY$216,Translating_products!CM137, FALSE)","v":"iButton Reader 1-Wire Outdoor"},{"$f":"IF(ISBLANK($Q$1),HLOOKUP(Main!$C$2,Translating_products!$EE$4:$EU$216,Translating_products!CM137,FALSE),HLOOKUP($Q$1,Translating_products!$EE$4:$EU$216,Translating_products!CM137,FALSE))","v":38},38,0,"belegt 1 kanal von 1 Wire (Zutritt)","Zutritt",null,null,null,null,1.0,"nix",null,"$"]
[null,{"$f":"Calculation!C309","v":0},{"$f":"HLOOKUP(Main!$C$2,Translating_products!$CN$4:$DD$216,Translating_products!CM138, FALSE)","v":"not available in this country"},{"$f":"HLOOKUP(Main!$C$2,Translating_products!$DI$4:$DY$216,Translating_products!CM138, FALSE)","v":"not available in this country"},{"$f":"IF(ISBLANK($Q$1),HLOOKUP(Main!$C$2,Translating_products!$EE$4:$EU$216,Translating_products!CM138,FALSE),HLOOKUP($Q$1,Translating_products!$EE$4:$EU$216,Translating_products!CM138,FALSE))","v":0},0,0,"Stück-Auswahl Sonstiges","Sonstiges",null,null,null,null,null,"nix",null,"$"]
[null,{"$f":"Calculation!C126","v":0},{"$f":"HLOOKUP(Main!$C$2,Translating_products!$CN$4:$DD$216,Translating_products!CM139, FALSE)","v":200202},{"$f":"HLOOKUP(Main!$C$2,Translating_products!$DI$4:$DY$216,Translating_products!CM139, FALSE)","v":"Loxone Speaker Back Box For Suspended Ceilings"},{"$f":"IF(ISBLANK($Q$1),HLOOKUP(Main!$C$2,Translating_products!$EE$4:$EU$216,Translating_products!CM139,FALSE),HLOOKUP($Q$1,Translating_products!$EE$4:$EU$216,Translating_products!CM139,FALSE))","v":39},39,0,"Stück-Auswahl Musik","Musik",null,null,null,null,null,"nix",null,"$"]
[null,{"$f":"Calculation!C89","v":0},{"$f":"HLOOKUP(Main!$C$2,Translating_products!$CN$4:$DD$216,Translating_products!CM140, FALSE)","v":200280},{"$f":"HLOOKUP(Main!$C$2,Translating_products!$DI$4:$DY$216,Translating_products!CM140, FALSE)","v":"LED Strip Accessories Set - RGBW"},{"$f":"IF(ISBLANK($Q$1),HLOOKUP(Main!$C$2,Translating_products!$EE$4:$EU$216,Translating_products!CM140,FALSE),HLOOKUP($Q$1,Translating_products!$EE$4:$EU$216,Translating_products!CM140,FALSE))","v":19},19,0,null,null,null,null,null,null,null,null,null,"$"]
[null,{"$f":"Calculation!C90","v":0},{"$f":"HLOOKUP(Main!$C$2,Translating_products!$CN$4:$DD$216,Translating_products!CM141, FALSE)","v":200278},{"$f":"HLOOKUP(Main!$C$2,Translating_products!$DI$4:$DY$216,Translating_products!CM141, FALSE)","v":"LED Strip Accessories Set - Warm White"},{"$f":"IF(ISBLANK($Q$1),HLOOKUP(Main!$C$2,Translating_products!$EE$4:$EU$216,Translating_products!CM141,FALSE),HLOOKUP($Q$1,Translating_products!$EE$4:$EU$216,Translating_products!CM141,FALSE))","v":14},14,0,null,null,null,null,null,null,null,null,null,"$"]
[null,{"$f":"Calculation!C308","v":0},{"$f":"IF(ISBLANK($Q$1), HLOOKUP(Main!$C$2,Translating_products!$CN$4:$DD$216,Translating_products!CM142, FALSE), HLOOKUP($Q$1,Translating_products!$CN$4:$DD$216,Translating_products!CM142, FALSE))","v":200161},{"$f":"HLOOKUP(Main!$C$2,Translating_products!$DI$4:$DY$216,Translating_products!CM142, FALSE)","v":"Power Adapter 24V 6.25A"},{"$f":"IF(ISBLANK($Q$1),HLOOKUP(Main!$C$2,Translating_products!$EE$4:$EU$216,Translating_products!CM142,FALSE),HLOOKUP($Q$1,Translating_products!$EE$4:$EU$216,Translating_products!CM142,FALSE))","v":84.9},84.9,0,null,null,null,null,null,null,null,null,null,"$"]
[null,{"$f":"Calculation!C125","v":0},{"$f":"HLOOKUP(Main!$C$2,Translating_products!$CN$4:$DD$216,Translating_products!CM143, FALSE)","v":100205},{"$f":"HLOOKUP(Main!$C$2,Translating_products!$DI$4:$DY$216,Translating_products!CM143, FALSE)","v":"Loxone Music Server Upgrade"},{"$f":"IF(ISBLANK($Q$1),HLOOKUP(Main!$C$2,Translating_products!$EE$4:$EU$216,Translating_products!CM143,FALSE),HLOOKUP($Q$1,Translating_products!$EE$4:$EU$216,Translating_products!CM143,FALSE))","v":140.09},140.09,0,null,null,null,null,null,null,null,null,null,"$"]
[null,{"$f":"Calculation!C159","v":0},{"$f":"IF(ISBLANK($Q$1),HLOOKUP(Main!$C$2,Translating_products!$CN$4:$DD$216,Translating_products!CM144,FALSE),HLOOKUP($Q$1,Translating_products!$CN$4:$DD$216,Translating_products!CM144,FALSE))","v":200274},{"$f":"HLOOKUP(Main!$C$2,Translating_products!$DI$4:$DY$216,Translating_products!CM144, FALSE)","v":"Loxone Intercom XL"},{"$f":"IF(ISBLANK($Q$1),HLOOKUP(Main!$C$2,Translating_products!$EE$4:$EU$216,Translating_products!CM144,FALSE),HLOOKUP($Q$1,Translating_products!$EE$4:$EU$216,Translating_products!CM144,FALSE))","v":1269},1269,0,"Stück-Auswähl Zutritt","Zutritt",null,null,null,null,null,"nix",null,"$"]
[null,{"$f":"Calculation!C244","v":0},{"$f":"HLOOKUP(Main!$C$2,Translating_products!$CN$4:$DD$216,Translating_products!CM145, FALSE)","v":100190},{"$f":"HLOOKUP(Main!$C$2,Translating_products!$DI$4:$DY$216,Translating_products!CM145, FALSE)","v":"Motion Sensor Air"},{"$f":"IF(ISBLANK($Q$1),HLOOKUP(Main!$C$2,Translating_products!$EE$4:$EU$216,Translating_products!CM145,FALSE),HLOOKUP($Q$1,Translating_products!$EE$4:$EU$216,Translating_products!CM145,FALSE))","v":95},95,0,null,null,null,null,null,null,1.0,null,null,"$"]
[null,{"$f":"Calculation!C310","v":0},{"$f":"HLOOKUP(Main!$C$2,Translating_products!$CN$4:$DD$216,Translating_products!CM146, FALSE)","v":200281},{"$f":"HLOOKUP(Main!$C$2,Translating_products!$DI$4:$DY$216,Translating_products!CM146, FALSE)","v":"NFC Smart Tags"},{"$f":"IF(ISBLANK($Q$1),HLOOKUP(Main!$C$2,Translating_products!$EE$4:$EU$216,Translating_products!CM146,FALSE),HLOOKUP($Q$1,Translating_products!$EE$4:$EU$216,Translating_products!CM146,FALSE))","v":26},26,0,null,null,null,null,null,null,null,null,null,"$"]
[null,{"$f":"Calculation!C93","v":0},{"$f":"HLOOKUP(Main!$C$2,Translating_products!$CN$4:$DD$216,Translating_products!CM147, FALSE)","v":100204},{"$f":"HLOOKUP(Main!$C$2,Translating_products!$DI$4:$DY$216,Translating_products!CM147, FALSE)","v":"LED Spot RGBW"},{"$f":"IF(ISBLANK($Q$1),HLOOKUP(Main!$C$2,Translating_products!$EE$4:$EU$216,Translating_products!CM147,FALSE),HLOOKUP($Q$1,Translating_products!$EE$4:$EU$216,Translating_products!CM147,FALSE))","v":55},55,0,null,null,null,null,null,null,null,null,null,"$"]
[null,{"$f":"Calculation!C94","v":0},{"$f":"HLOOKUP(Main!$C$2,Translating_products!$CN$4:$DD$216,Translating_products!CM148, FALSE)","v":100203},{"$f":"HLOOKUP(Main!$C$2,Translating_products!$DI$4:$DY$216,Translating_products!CM148, FALSE)","v":"LED Spot Warm White"},{"$f":"IF(ISBLANK($Q$1),HLOOKUP(Main!$C$2,Translating_products!$EE$4:$EU$216,Translating_products!CM148,FALSE),HLOOKUP($Q$1,Translating_products!$EE$4:$EU$216,Translating_products!CM148,FALSE))","v":39},39,0,null,null,null,null,null,null,null,null,null,"$"]
[null,{"$f":"Calculation!C311","v":0},{"$f":"HLOOKUP(Main!$C$2,Translating_products!$CN$4:$DD$216,Translating_products!CM149, FALSE)","v":"not available in this country"},{"$f":"HLOOKUP(Main!$C$2,Translating_products!$DI$4:$DY$216,Translating_products!CM149, FALSE)","v":"not available in this country"},{"$f":"IF(ISBLANK($Q$1),HLOOKUP(Main!$C$2,Translating_products!$EE$4:$EU$216,Translating_products!CM149,FALSE),HLOOKUP($Q$1,Translating_products!$EE$4:$EU$216,Translating_products!CM149,FALSE))","v":0},0,0,null,null,null,null,null,null,null,null,null,"$"]
[null,{"$f":"Calculation!C260+Calculation!C44+Calculation!C394","v":0},{"$f":"HLOOKUP(Main!$C$2,Translating_products!$CN$4:$DD$216,Translating_products!CM150, FALSE)","v":100218},{"$f":"HLOOKUP(Main!$C$2,Translating_products!$DI$4:$DY$216,Translating_products!CM150, FALSE)","v":"Tree Extension"},{"$f":"IF(ISBLANK($Q$1),HLOOKUP(Main!$C$2,Translating_products!$EE$4:$EU$216,Translating_products!CM150,FALSE),HLOOKUP($Q$1,Translating_products!$EE$4:$EU$216,Translating_products!CM150,FALSE))","v":99},99,0,null,"Tree",null,null,null,null,100.0,0.0048,null,"$"]
[null,{"$f":"Calculation!C261+Calculation!C366","v":0},{"$f":"HLOOKUP(Main!$C$2,Translating_products!$CN$4:$DD$216,Translating_products!CM151, FALSE)","v":100221},{"$f":"HLOOKUP(Main!$C$2,Translating_products!$DI$4:$DY$216,Translating_products!CM151, FALSE)","v":"Touch Tree White"},{"$f":"IF(ISBLANK($Q$1),HLOOKUP(Main!$C$2,Translating_products!$EE$4:$EU$216,Translating_products!CM151,FALSE),HLOOKUP($Q$1,Translating_products!$EE$4:$EU$216,Translating_products!CM151,FALSE))","v":79},79,0,null,"Tree",null,null,null,null,1.0,0.0048,null,"$"]
[null,{"$f":"Calculation!C262+Calculation!C369","v":0},{"$f":"HLOOKUP(Main!$C$2,Translating_products!$CN$4:$DD$216,Translating_products!CM152, FALSE)","v":100222},{"$f":"HLOOKUP(Main!$C$2,Translating_products!$DI$4:$DY$216,Translating_products!CM152, FALSE)","v":"Touch Tree Black"},{"$f":"IF(ISBLANK($Q$1),HLOOKUP(Main!$C$2,Translating_products!$EE$4:$EU$216,Translating_products!CM152,FALSE),HLOOKUP($Q$1,Translating_products!$EE$4:$EU$216,Translating_products!CM152,FALSE))","v":79},79,0,null,"Tree",null,null,null,null,1.0,0.0048,null,"$"]
[null,{"$f":"Calculation!C263+Calculation!C188","v":0},{"$f":"HLOOKUP(Main!$C$2,Translating_products!$CN$4:$DD$216,Translating_products!CM153, FALSE)","v":100223},{"$f":"HLOOKUP(Main!$C$2,Translating_products!$DI$4:$DY$216,Translating_products!CM153, FALSE)","v":"Motion Sensor Tree White"},{"$f":"IF(ISBLANK($Q$1),HLOOKUP(Main!$C$2,Translating_products!$EE$4:$EU$216,Translating_products!CM153,FALSE),HLOOKUP($Q$1,Translating_products!$EE$4:$EU$216,Translating_products!CM153,FALSE))","v":86},86,0,null,"Tree",null,null,null,null,1.0,0.0048,null,"$"]
[null,{"$f":"Calculation!C264+Calculation!C140","v":0},{"$f":"HLOOKUP(Main!$C$2,Translating_products!$CN$4:$DD$216,Translating_products!CM154, FALSE)","v":100225},{"$f":"HLOOKUP(Main!$C$2,Translating_products!$DI$4:$DY$216,Translating_products!CM154, FALSE)","v":"Valve Actuator Tree"},{"$f":"IF(ISBLANK($Q$1),HLOOKUP(Main!$C$2,Translating_products!$EE$4:$EU$216,Translating_products!CM154,FALSE),HLOOKUP($Q$1,Translating_products!$EE$4:$EU$216,Translating_products!CM154,FALSE))","v":76},76,0,null,"Tree",null,null,null,null,1.0,0.0625,null,"$"]
[null,{"$f":"Calculation!C246+Calculation!C189","v":0},{"$f":"HLOOKUP(Main!$C$2,Translating_products!$CN$4:$DD$216,Translating_products!CM155, FALSE)","v":100211},{"$f":"HLOOKUP(Main!$C$2,Translating_products!$DI$4:$DY$216,Translating_products!CM155, FALSE)","v":"Water Sensor Air"},{"$f":"IF(ISBLANK($Q$1),HLOOKUP(Main!$C$2,Translating_products!$EE$4:$EU$216,Translating_products!CM155,FALSE),HLOOKUP($Q$1,Translating_products!$EE$4:$EU$216,Translating_products!CM155,FALSE))","v":59},59,0,null,"Air",null,null,null,null,1.0,null,null,"$"]
[null,{"$f":"Calculation!C247+Calculation!C190","v":0},{"$f":"HLOOKUP(Main!$C$2,Translating_products!$CN$4:$DD$216,Translating_products!CM156, FALSE)","v":100213},{"$f":"HLOOKUP(Main!$C$2,Translating_products!$DI$4:$DY$216,Translating_products!CM156, FALSE)","v":"Door & Window Contact Air Black"},{"$f":"IF(ISBLANK($Q$1),HLOOKUP(Main!$C$2,Translating_products!$EE$4:$EU$216,Translating_products!CM156,FALSE),HLOOKUP($Q$1,Translating_products!$EE$4:$EU$216,Translating_products!CM156,FALSE))","v":59},59,0,null,"Air",null,null,null,null,1.0,null,null,"$"]
[null,{"$f":"Calculation!C248+Calculation!C191","v":0},{"$f":"HLOOKUP(Main!$C$2,Translating_products!$CN$4:$DD$216,Translating_products!CM157, FALSE)","v":100210},{"$f":"HLOOKUP(Main!$C$2,Translating_products!$DI$4:$DY$216,Translating_products!CM157, FALSE)","v":"Door & Window Contact Air White"},{"$f":"IF(ISBLANK($Q$1),HLOOKUP(Main!$C$2,Translating_products!$EE$4:$EU$216,Translating_products!CM157,FALSE),HLOOKUP($Q$1,Translating_products!$EE$4:$EU$216,Translating_products!CM157,FALSE))","v":59},59,0,null,"Air",null,null,null,null,1.0,null,null,"$"]
[null,{"$f":"Calculation!C265+Calculation!C187","v":0},{"$f":"HLOOKUP(Main!$C$2,Translating_products!$CN$4:$DD$216,Translating_products!CM158, FALSE)","v":100224},{"$f":"HLOOKUP(Main!$C$2,Translating_products!$DI$4:$DY$216,Translating_products!CM158, FALSE)","v":"Motion Sensor Tree Black"},{"$f":"IF(ISBLANK($Q$1),HLOOKUP(Main!$C$2,Translating_products!$EE$4:$EU$216,Translating_products!CM158,FALSE),HLOOKUP($Q$1,Translating_products!$EE$4:$EU$216,Translating_products!CM158,FALSE))","v":86},86,0,null,null,null,null,null,null,null,null,null,"$"]
[null,{"$f":"Calculation!C217","v":0},{"$f":"HLOOKUP(Main!$C$2,Translating_products!$CN$4:$DD$216,Translating_products!CM159, FALSE)","v":200204},{"$f":"HLOOKUP(Main!$C$2,Translating_products!$DI$4:$DY$216,Translating_products!CM159, FALSE)","v":"Cross Connector for Mains Terminals (20 pcs)"},{"$f":"IF(ISBLANK($Q$1),HLOOKUP(Main!$C$2,Translating_products!$EE$4:$EU$216,Translating_products!CM159,FALSE),HLOOKUP($Q$1,Translating_products!$EE$4:$EU$216,Translating_products!CM159,FALSE))","v":96},96,0,null,null,null,null,null,null,null,null,null,"$"]
[null,{"$f":"Calculation!C395+Calculation!C45","v":0},{"$f":"HLOOKUP(Main!$C$2,Translating_products!$CN$4:$DD$216,Translating_products!CM160, FALSE)","v":100200},{"$f":"HLOOKUP(Main!$C$2,Translating_products!$DI$4:$DY$216,Translating_products!CM160, FALSE)","v":"Dali Extension"},{"$f":"IF(ISBLANK($Q$1),HLOOKUP(Main!$C$2,Translating_products!$EE$4:$EU$216,Translating_products!CM160,FALSE),HLOOKUP($Q$1,Translating_products!$EE$4:$EU$216,Translating_products!CM160,FALSE))","v":499},499,0,null,null,null,null,null,null,null,null,null,"$"]
[null,{"$f":"Calculation!C312","v":0},{"$f":"HLOOKUP(Main!$C$2,Translating_products!$CN$4:$DD$216,Translating_products!CM161, FALSE)","v":200297},{"$f":"HLOOKUP(Main!$C$2,Translating_products!$DI$4:$DY$216,Translating_products!CM161, FALSE)","v":"24V LED Power Supply (2.5A)"},{"$f":"IF(ISBLANK($Q$1),HLOOKUP(Main!$C$2,Translating_products!$EE$4:$EU$216,Translating_products!CM161,FALSE),HLOOKUP($Q$1,Translating_products!$EE$4:$EU$216,Translating_products!CM161,FALSE))","v":35},35,0,null,null,null,null,null,null,null,null,null,"$"]
[null,{"$f":"Calculation!C266+Calculation!C250+Calculation!C370","v":0},{"$f":"HLOOKUP(Main!$C$2,Translating_products!$CN$4:$DD$216,Translating_products!CM162, FALSE)","v":100206},{"$f":"HLOOKUP(Main!$C$2,Translating_products!$DI$4:$DY$216,Translating_products!CM162, FALSE)","v":"Touch pure Air White"},{"$f":"IF(ISBLANK($Q$1),HLOOKUP(Main!$C$2,Translating_products!$EE$4:$EU$216,Translating_products!CM162,FALSE),HLOOKUP($Q$1,Translating_products!$EE$4:$EU$216,Translating_products!CM162,FALSE))","v":179},179,0,null,null,null,null,null,null,null,null,null,"$"]
[null,{"$f":"Calculation!C266+Calculation!C249+Calculation!C367","v":0},{"$f":"HLOOKUP(Main!$C$2,Translating_products!$CN$4:$DD$216,Translating_products!CM163, FALSE)","v":100207},{"$f":"HLOOKUP(Main!$C$2,Translating_products!$DI$4:$DY$216,Translating_products!CM163, FALSE)","v":"Touch pure for Nano White"},{"$f":"IF(ISBLANK($Q$1),HLOOKUP(Main!$C$2,Translating_products!$EE$4:$EU$216,Translating_products!CM163,FALSE),HLOOKUP($Q$1,Translating_products!$EE$4:$EU$216,Translating_products!CM163,FALSE))","v":119},119,0,null,null,null,null,null,null,null,null,null,"$"]
[null,{"$f":"Calculation!C267+Calculation!C368","v":0},{"$f":"HLOOKUP(Main!$C$2,Translating_products!$CN$4:$DD$216,Translating_products!CM164, FALSE)","v":100219},{"$f":"HLOOKUP(Main!$C$2,Translating_products!$DI$4:$DY$216,Translating_products!CM164, FALSE)","v":"Touch pure Tree White"},{"$f":"IF(ISBLANK($Q$1),HLOOKUP(Main!$C$2,Translating_products!$EE$4:$EU$216,Translating_products!CM164,FALSE),HLOOKUP($Q$1,Translating_products!$EE$4:$EU$216,Translating_products!CM164,FALSE))","v":179},179,0,null,null,null,null,null,null,null,null,null,"$"]
[null,{"$f":"Calculation!C396","v":0},{"$f":"HLOOKUP(Main!$C$2,Translating_products!$CN$4:$DD$216,Translating_products!CM165, FALSE)","v":"not available in this country"},{"$f":"IF(ISBLANK(Q1), HLOOKUP(Main!$C$2,Translating_products!$DI$4:$DY$216,Translating_products!CM165, FALSE),\"Not available in this country\")","v":"not available in this country"},{"$f":"IF(ISBLANK($Q$1),HLOOKUP(Main!$C$2,Translating_products!$EE$4:$EU$216,Translating_products!CM165,FALSE),HLOOKUP($Q$1,Translating_products!$EE$4:$EU$216,Translating_products!CM165,FALSE))","v":0},0,0,null,null,null,null,null,null,null,null,null,"$"]
[null,{"$f":"Calculation!C251","v":0},{"$f":"HLOOKUP(Main!$C$2,Translating_products!$CN$4:$DD$216,Translating_products!CM166, FALSE)","v":"not available in this country"},{"$f":"HLOOKUP(Main!$C$2,Translating_products!$DI$4:$DY$216,Translating_products!CM166, FALSE)","v":"not available in this country"},{"$f":"IF(ISBLANK($Q$1),HLOOKUP(Main!$C$2,Translating_products!$EE$4:$EU$216,Translating_products!CM166,FALSE),HLOOKUP($Q$1,Translating_products!$EE$4:$EU$216,Translating_products!CM166,FALSE))","v":0},0,0,null,null,null,null,null,null,null,null,null,"$"]
[null,{"$f":"Calculation!C313","v":0},{"$f":"HLOOKUP(Main!$C$2,Translating_products!$CN$4:$DD$216,Translating_products!CM167, FALSE)","v":200300},{"$f":"HLOOKUP(Main!$C$2,Translating_products!$DI$4:$DY$216,Translating_products!CM167, FALSE)","v":"Panel wire (328ft) blue/white"},{"$f":"IF(ISBLANK($Q$1),HLOOKUP(Main!$C$2,Translating_products!$EE$4:$EU$216,Translating_products!CM167,FALSE),HLOOKUP($Q$1,Translating_products!$EE$4:$EU$216,Translating_products!CM167,FALSE))","v":30.5},30.5,0,null,null,null,null,null,null,null,null,null,"$"]
[null,{"$f":"Calculation!C314","v":0},{"$f":"HLOOKUP(Main!$C$2,Translating_products!$CN$4:$DD$216,Translating_products!CM168, FALSE)","v":200301},{"$f":"HLOOKUP(Main!$C$2,Translating_products!$DI$4:$DY$216,Translating_products!CM168, FALSE)","v":"Panel wire (328ft) orange/white"},{"$f":"IF(ISBLANK($Q$1),HLOOKUP(Main!$C$2,Translating_products!$EE$4:$EU$216,Translating_products!CM168,FALSE),HLOOKUP($Q$1,Translating_products!$EE$4:$EU$216,Translating_products!CM168,FALSE))","v":30.5},30.5,0,null,null,null,null,null,null,null,null,null,"$"]
[null,{"$f":"Calculation!C315","v":0},{"$f":"HLOOKUP(Main!$C$2,Translating_products!$CN$4:$DD$216,Translating_products!CM169, FALSE)","v":200302},{"$f":"HLOOKUP(Main!$C$2,Translating_products!$DI$4:$DY$216,Translating_products!CM169, FALSE)","v":"Panel wire (328ft) green/white"},{"$f":"IF(ISBLANK($Q$1),HLOOKUP(Main!$C$2,Translating_products!$EE$4:$EU$216,Translating_products!CM169,FALSE),HLOOKUP($Q$1,Translating_products!$EE$4:$EU$216,Translating_products!CM169,FALSE))","v":30.5},30.5,0,null,null,null,null,null,null,null,null,null,"$"]
[null,{"$f":"Calculation!C316","v":0},{"$f":"HLOOKUP(Main!$C$2,Translating_products!$CN$4:$DD$216,Translating_products!CM170, FALSE)","v":"not available in this country"},{"$f":"HLOOKUP(Main!$C$2,Translating_products!$DI$4:$DY$216,Translating_products!CM170, FALSE)","v":"not available in this country"},{"$f":"IF(ISBLANK($Q$1),HLOOKUP(Main!$C$2,Translating_products!$EE$4:$EU$216,Translating_products!CM170,FALSE),HLOOKUP($Q$1,Translating_products!$EE$4:$EU$216,Translating_products!CM170,FALSE))","v":0},0,0,null,null,null,null,null,null,null,null,null,"$"]
[null,{"$f":"Calculation!C317","v":0},{"$f":"HLOOKUP(Main!$C$2,Translating_products!$CN$4:$DD$216,Translating_products!CM171, FALSE)","v":"not available in this country"},{"$f":"HLOOKUP(Main!$C$2,Translating_products!$DI$4:$DY$216,Translating_products!CM171, FALSE)","v":"not available in this country"},{"$f":"IF(ISBLANK($Q$1),HLOOKUP(Main!$C$2,Translating_products!$EE$4:$EU$216,Translating_products!CM171,FALSE),HLOOKUP($Q$1,Translating_products!$EE$4:$EU$216,Translating_products!CM171,FALSE))","v":0},0,0,null,null,null,null,null,null,null,null,null,"$"]
[null,{"$f":"Calculation!C318","v":0},{"$f":"HLOOKUP(Main!$C$2,Translating_products!$CN$4:$DD$216,Translating_products!CM172, FALSE)","v":"not available in this country"},{"$f":"HLOOKUP(Main!$C$2,Translating_products!$DI$4:$DY$216,Translating_products!CM172, FALSE)","v":"not available in this country"},{"$f":"IF(ISBLANK($Q$1),HLOOKUP(Main!$C$2,Translating_products!$EE$4:$EU$216,Translating_products!CM172,FALSE),HLOOKUP($Q$1,Translating_products!$EE$4:$EU$216,Translating_products!CM172,FALSE))","v":0},0,0,null,null,null,null,null,null,null,null,null,"$"]
[null,{"$f":"Calculation!C319","v":0},{"$f":"HLOOKUP(Main!$C$2,Translating_products!$CN$4:$DD$216,Translating_products!CM173, FALSE)","v":"not available in this country"},{"$f":"HLOOKUP(Main!$C$2,Translating_products!$DI$4:$DY$216,Translating_products!CM173, FALSE)","v":"not available in this country"},{"$f":"IF(ISBLANK($Q$1),HLOOKUP(Main!$C$2,Translating_products!$EE$4:$EU$216,Translating_products!CM173,FALSE),HLOOKUP($Q$1,Translating_products!$EE$4:$EU$216,Translating_products!CM173,FALSE))","v":0},0,0,null,null,null,null,null,null,null,null,null,"$"]
[null,{"$f":"Calculation!C320","v":0},{"$f":"HLOOKUP(Main!$C$2,Translating_products!$CN$4:$DD$216,Translating_products!CM174, FALSE)","v":"not available in this country"},{"$f":"HLOOKUP(Main!$C$2,Translating_products!$DI$4:$DY$216,Translating_products!CM174, FALSE)","v":"not available in this country"},{"$f":"IF(ISBLANK($Q$1),HLOOKUP(Main!$C$2,Translating_products!$EE$4:$EU$216,Translating_products!CM174,FALSE),HLOOKUP($Q$1,Translating_products!$EE$4:$EU$216,Translating_products!CM174,FALSE))","v":0},0,0,null,null,null,null,null,null,null,null,null,"$"]
[null,{"$f":"Calculation!C268","v":0},{"$f":"HLOOKUP(Main!$C$2,Translating_products!$CN$4:$DD$216,Translating_products!CM175, FALSE)","v":100242},{"$f":"HLOOKUP(Main!$C$2,Translating_products!$DI$4:$DY$216,Translating_products!CM175, FALSE)","v":"Nano DI Tree"},{"$f":"IF(ISBLANK($Q$1),HLOOKUP(Main!$C$2,Translating_products!$EE$4:$EU$216,Translating_products!CM175,FALSE),HLOOKUP($Q$1,Translating_products!$EE$4:$EU$216,Translating_products!CM175,FALSE))","v":69},69,0,null,null,null,null,null,null,null,null,null,"$"]
[null,{"$f":"IF(ISBLANK(Q1),0,Calculation!C321)","v":0},{"$f":"IF(ISBLANK(Q1),\"0\",\"100294\")","v":"0"},{"$f":"IF(ISBLANK(Q1),\"not available in this country\", HLOOKUP(Main!$C$2,Translating_products!$DI$4:$DY$216,Translating_products!CM176, FALSE))","v":"not available in this country"},{"$f":"IF(ISBLANK(Q1),\"0\",IF(ISBLANK($Q$1),HLOOKUP(Main!$C$2,Translating_products!$EE$4:$EU$216,Translating_products!CM176,FALSE),HLOOKUP($Q$1,Translating_products!$EE$4:$EU$216,Translating_products!CM176,FALSE)))","v":"0"},0,0,null,null,null,null,null,null,null,null,null,"$"]
[null,{"$f":"Calculation!C371+Calculation!C252","v":0},{"$f":"HLOOKUP(Main!$C$2,Translating_products!$CN$4:$DD$216,Translating_products!CM177, FALSE)","v":100209},{"$f":"HLOOKUP(Main!$C$2,Translating_products!$DI$4:$DY$216,Translating_products!CM177, FALSE)","v":"Touch pure Nano Black"},{"$f":"IF(ISBLANK($Q$1),HLOOKUP(Main!$C$2,Translating_products!$EE$4:$EU$216,Translating_products!CM177,FALSE),HLOOKUP($Q$1,Translating_products!$EE$4:$EU$216,Translating_products!CM177,FALSE))","v":119},119,0,null,null,null,null,null,null,null,null,null,"$"]
[null,{"$f":"Calculation!C372+Calculation!C269","v":0},{"$f":"HLOOKUP(Main!$C$2,Translating_products!$CN$4:$DD$216,Translating_products!CM178, FALSE)","v":100220},{"$f":"HLOOKUP(Main!$C$2,Translating_products!$DI$4:$DY$216,Translating_products!CM178, FALSE)","v":"Touch pure Tree Black"},{"$f":"IF(ISBLANK($Q$1),HLOOKUP(Main!$C$2,Translating_products!$EE$4:$EU$216,Translating_products!CM178,FALSE),HLOOKUP($Q$1,Translating_products!$EE$4:$EU$216,Translating_products!CM178,FALSE))","v":179},179,0,null,null,null,null,null,null,null,null,null,"$"]
[null,{"$f":"Calculation!C253+Calculation!C373","v":0},{"$f":"HLOOKUP(Main!$C$2,Translating_products!$CN$4:$DD$216,Translating_products!CM179, FALSE)","v":100208},{"$f":"HLOOKUP(Main!$C$2,Translating_products!$DI$4:$DY$216,Translating_products!CM179, FALSE)","v":"Touch pure Air Black"},{"$f":"IF(ISBLANK($Q$1),HLOOKUP(Main!$C$2,Translating_products!$EE$4:$EU$216,Translating_products!CM179,FALSE),HLOOKUP($Q$1,Translating_products!$EE$4:$EU$216,Translating_products!CM179,FALSE))","v":179},179,0,null,null,null,null,null,null,null,null,null,"$"]
[null,{"$f":"Calculation!C96","v":0},{"$f":"HLOOKUP(Main!$C$2,Translating_products!$CN$4:$DD$216,Translating_products!CM180, FALSE)","v":100235},{"$f":"HLOOKUP(Main!$C$2,Translating_products!$DI$4:$DY$216,Translating_products!CM180, FALSE)","v":"LED Ceiling Spot RGBW"},{"$f":"IF(ISBLANK($Q$1),HLOOKUP(Main!$C$2,Translating_products!$EE$4:$EU$216,Translating_products!CM180,FALSE),HLOOKUP($Q$1,Translating_products!$EE$4:$EU$216,Translating_products!CM180,FALSE))","v":89},89,0,null,null,null,null,null,null,null,null,null,"$"]
[null,{"$f":"Calculation!C97","v":0},{"$f":"HLOOKUP(Main!$C$2,Translating_products!$CN$4:$DD$216,Translating_products!CM181, FALSE)","v":100236},{"$f":"HLOOKUP(Main!$C$2,Translating_products!$DI$4:$DY$216,Translating_products!CM181, FALSE)","v":"LED Ceiling Spot WW"},{"$f":"IF(ISBLANK($Q$1),HLOOKUP(Main!$C$2,Translating_products!$EE$4:$EU$216,Translating_products!CM181,FALSE),HLOOKUP($Q$1,Translating_products!$EE$4:$EU$216,Translating_products!CM181,FALSE))","v":69},69,0,null,null,null,null,null,null,null,null,null,"$"]
[null,{"$f":"Calculation!C98","v":0},{"$f":"HLOOKUP(Main!$C$2,Translating_products!$CN$4:$DD$216,Translating_products!CM182, FALSE)","v":100237},{"$f":"HLOOKUP(Main!$C$2,Translating_products!$DI$4:$DY$216,Translating_products!CM182, FALSE)","v":"LED Ceiling Spot Tree RGBW"},{"$f":"IF(ISBLANK($Q$1),HLOOKUP(Main!$C$2,Translating_products!$EE$4:$EU$216,Translating_products!CM182,FALSE),HLOOKUP($Q$1,Translating_products!$EE$4:$EU$216,Translating_products!CM182,FALSE))","v":139},139,0,null,null,null,null,null,null,null,null,null,"$"]
[null,{"$f":"Calculation!C99","v":0},{"$f":"HLOOKUP(Main!$C$2,Translating_products!$CN$4:$DD$216,Translating_products!CM183, FALSE)","v":100238},{"$f":"HLOOKUP(Main!$C$2,Translating_products!$DI$4:$DY$216,Translating_products!CM183, FALSE)","v":"LED Ceiling Spot Tree WW"},{"$f":"IF(ISBLANK($Q$1),HLOOKUP(Main!$C$2,Translating_products!$EE$4:$EU$216,Translating_products!CM183,FALSE),HLOOKUP($Q$1,Translating_products!$EE$4:$EU$216,Translating_products!CM183,FALSE))","v":109},109,0,null,null,null,null,null,null,null,null,null,"$"]
[null,{"$f":"Calculation!C100","v":0},{"$f":"HLOOKUP(Main!$C$2,Translating_products!$CN$4:$DD$216,Translating_products!CM184, FALSE)","v":100268},{"$f":"HLOOKUP(Main!$C$2,Translating_products!$DI$4:$DY$216,Translating_products!CM184, FALSE)","v":"LED Spot Tree WW"},{"$f":"IF(ISBLANK($Q$1),HLOOKUP(Main!$C$2,Translating_products!$EE$4:$EU$216,Translating_products!CM184,FALSE),HLOOKUP($Q$1,Translating_products!$EE$4:$EU$216,Translating_products!CM184,FALSE))","v":69},69,0,null,null,null,null,null,null,null,null,null,"$"]
[null,{"$f":"Calculation!C101","v":0},{"$f":"HLOOKUP(Main!$C$2,Translating_products!$CN$4:$DD$216,Translating_products!CM185, FALSE)","v":100269},{"$f":"HLOOKUP(Main!$C$2,Translating_products!$DI$4:$DY$216,Translating_products!CM185, FALSE)","v":"LED Spot Tree RGBW"},{"$f":"IF(ISBLANK($Q$1),HLOOKUP(Main!$C$2,Translating_products!$EE$4:$EU$216,Translating_products!CM185,FALSE),HLOOKUP($Q$1,Translating_products!$EE$4:$EU$216,Translating_products!CM185,FALSE))","v":89},89,0,null,null,null,null,null,null,null,null,null,"$"]
[null,{"$f":"Calculation!C102+Calculation!C274","v":0},{"$f":"HLOOKUP(Main!$C$2,Translating_products!$CN$4:$DD$216,Translating_products!CM186, FALSE)","v":100239},{"$f":"HLOOKUP(Main!$C$2,Translating_products!$DI$4:$DY$216,Translating_products!CM186, FALSE)","v":"RGBW 24V Dimmer Tree"},{"$f":"IF(ISBLANK($Q$1),HLOOKUP(Main!$C$2,Translating_products!$EE$4:$EU$216,Translating_products!CM186,FALSE),HLOOKUP($Q$1,Translating_products!$EE$4:$EU$216,Translating_products!CM186,FALSE))","v":69},69,0,null,null,null,null,null,null,null,null,null,"$"]
[null,{"$f":"Calculation!C254+Calculation!C194","v":0},{"$f":"HLOOKUP(Main!$C$2,Translating_products!$CN$4:$DD$216,Translating_products!CM189, FALSE)","v":100177},{"$f":"HLOOKUP(Main!$C$2,Translating_products!$DI$4:$DY$216,Translating_products!CM189, FALSE)","v":"Window Handle Air"},{"$f":"IF(ISBLANK($Q$1),HLOOKUP(Main!$C$2,Translating_products!$EE$4:$EU$216,Translating_products!CM189,FALSE),HLOOKUP($Q$1,Translating_products!$EE$4:$EU$216,Translating_products!CM189,FALSE))","v":139},139,0,null,null,null,null,null,null,null,null,null,"$"]
[null,null,null,{"$f":"VLOOKUP(Main!C2,Translating_general!A77:AF94,9,FALSE)","v":"Total without taxes"},null,null,{"$f":"SUMPRODUCT(B7:B187,E7:E187)","v":0},null,null,null,null,null,null,null,null,null,"$"]
[null,null,null,{"$f":"IF(ISBLANK($Q$1),VLOOKUP(Main!C2,Translating_general!A77:IH97,37,FALSE),VLOOKUP(Q1,Translating_general!A77:IH96,37,FALSE))","v":"Discount"},null,"%",{"$f":"G188/100*E189","v":0},null,null,null,null,null,null,null,null,null,"$"]
[null,null,null,{"$f":"IF(ISBLANK($Q$1),VLOOKUP(Main!C2,Translating_general!A77:IH97,38,FALSE),VLOOKUP(Q1,Translating_general!A77:IH96,38,FALSE))","v":"Discounted Price"},null,null,{"$f":"G188-G189","v":0},null,null,null,null,null,null,null,null,null,"$"]
[null,null,null,{"$f":"VLOOKUP(Main!C2,Translating_general!A77:AF94,10,FALSE)","v":"+ Taxes"},{"$f":"IF(ISBLANK($Q$1),VLOOKUP(Main!C2,Translating_general!A77:IH94,35,FALSE),VLOOKUP(Q1,Translating_general!A77:IH94,35,FALSE))","v":""},"%",{"$f":"G190*(1+E191*0.01)-G190","v":0},null,null,null,null,null,null,null,null,null,"$"]
[null,null,null,{"$f":"VLOOKUP(Main!C2,Translating_general!A77:AF94,11,FALSE)","v":"Total with taxes"},null,null,{"$f":"G190+G191","v":0},null,null,null,null,null,null,null,null,null,"$"]
[]
[]
[null,null,{"$f":"VLOOKUP(Main!C2,Translating_general!A77:AF94,12,FALSE)","v":"Available"},null,{"$f":"VLOOKUP(Main!C2,Translating_general!A77:AF94,13,FALSE)","v":"Needed"},{"$f":"VLOOKUP(Main!C2,Translating_general!A77:AF94,14,FALSE)","v":"Left"}]
[null,null,{"$f":"Calculation!D52","v":0},{"$f":"VLOOKUP(Main!C2,Translating_general!A77:AF94,15,FALSE)","v":"Analog Inputs"},{"$f":"Calculation!D53","v":0},{"$f":"Calculation!D54","v":0}]
[null,null,{"$f":"Calculation!E52","v":0},{"$f":"VLOOKUP(Main!C2,Translating_general!A77:AF94,16,FALSE)","v":"Digital Inputs"},{"$f":"Calculation!E53","v":0},{"$f":"Calculation!E54","v":0}]
[null,null,{"$f":"Calculation!F52","v":0},{"$f":"VLOOKUP(Main!C2,Translating_general!A77:AF94,17,FALSE)","v":"Analog Outputs"},{"$f":"Calculation!F53","v":0},{"$f":"Calculation!F54","v":0}]
[null,null,{"$f":"Calculation!G52","v":0},{"$f":"VLOOKUP(Main!C2,Translating_general!A77:AF94,18,FALSE)","v":"Digital Outputs 5A"},{"$f":"Calculation!G53","v":0},{"$f":"Calculation!G54","v":0}]
[null,null,{"$f":"Calculation!H52","v":0},{"$f":"VLOOKUP(Main!C2,Translating_general!A77:AF94,19,FALSE)","v":"1-Wire Channel"},{"$f":"Calculation!H53","v":0},{"$f":"Calculation!H54","v":0}]
[null,null,{"$f":"Calculation!I52","v":0},{"$f":"VLOOKUP(Main!C2,Translating_general!A77:AF94,20,FALSE)","v":"Air Base Channels"},{"$f":"Calculation!I53","v":0},{"$f":"Calculation!I54","v":0}]
[null,null,{"$f":"Calculation!J52","v":0},{"$f":"VLOOKUP(Main!C2,Translating_general!A77:AF94,21,FALSE)","v":"Not available in this country"},{"$f":"Calculation!J53","v":0},{"$f":"Calculation!J54","v":0}]
[null,null,{"$f":"Calculation!L52","v":0},{"$f":"VLOOKUP(Main!C2,Translating_general!A77:AF94,22,FALSE)","v":"Digital Outputs 16A"},{"$f":"Calculation!L53","v":0},{"$f":"Calculation!L54","v":0}]
[null,null,{"$f":"Calculation!C77*4","v":0},{"$f":"VLOOKUP(Main!C2,Translating_general!A77:AF94,23,FALSE)","v":"Dimmer Channels"},{"$f":"Calculation!N77","v":0},{"$f":"C204-E204","v":0}]
[null,null,{"$f":"Calculation!O52","v":0},{"$f":"VLOOKUP(Main!C2,Translating_general!A101:AL118,38,FALSE)","v":"Dali Channels"},{"$f":"Calculation!O53","v":0},{"$f":"Calculation!O54","v":0}]
[null,null,{"$f":"Calculation!K44+Calculation!C260*Calculation!K71+Calculation!C394*Calculation!K71","v":0},{"$f":"VLOOKUP(Main!C2,Translating_general!A77:AH95,34,FALSE)","v":"Tree Channels"},{"$f":"Calculation!K42*(-1)+Calculation!C394*Calculation!K71","v":0},{"$f":"C206-E206","v":0}]
[]
[]
[null,null,null,{"$f":"VLOOKUP(Main!C2,Translating_general!A77:AF94,24,FALSE)","v":"Space Requirement Cabinett"}]
[null,null,null,{"$f":"VLOOKUP(Main!C2,Translating_general!A77:AF94,25,FALSE)","v":"in mm"},{"$f":"Space!I9","v":0}]
[null,null,null,{"$f":"VLOOKUP(Main!C2,Translating_general!A77:AF94,26,FALSE)","v":"in splitting units"},{"$f":"Space!I10","v":0}]
[]
[null,null,null,{"$f":"VLOOKUP(Main!C2,Translating_general!A77:AF94,27,FALSE)","v":"Powersupply Calc. In Ampere"}]
[null,null,null,null,{"$f":"VLOOKUP(Main!C2,Translating_general!A77:AF94,31,FALSE)","v":"Available"},{"$f":"VLOOKUP(Main!C2,Translating_general!A77:AF94,32,FALSE)","v":"Needed"}]
[null,null,null,{"$f":"VLOOKUP(Main!C2,Translating_general!A77:AF94,28,FALSE)","v":"Extension"},{"$f":"Calculation!J407","v":0},{"$f":"Calculation!J408","v":0}]
[null,null,null,{"$f":"VLOOKUP(Main!C2,Translating_general!A77:AF94,29,FALSE)","v":"LED"},{"$f":"Calculation!J423","v":0},{"$f":"Calculation!J424","v":0}]
[null,null,null,{"$f":"VLOOKUP(Main!C2,Translating_general!A77:AF94,30,FALSE)","v":"Periphery"},{"$f":"Calculation!J445","v":0},{"$f":"Calculation!J446","v":0}]
[null,"Please note that all the prices might have changed!"]
[null,"This tool was degsigned to support you as good as possible, if there are any mistakes in calculation please inform us! support@loxone.com"]

{"sheet":"News","index":19,"n_rows":19,"n_cols":12,"rows_kept":19,"cut":false,"hidden":false,"merged":[[8,1,9,4],[3,1,5,4],[6,1,7,4],[22,1,23,4],[24,1,25,4],[3,5,25,5],[3,0,25,0],[10,1,11,4],[12,1,13,4],[0,0,2,0],[8,11,9,14],[10,11,11,14],[3,11,5,14],[3,10,25,10],[12,11,13,14],[14,11,15,14],[20,11,21,14],[20,6,21,9],[6,11,7,14],[6,6,7,9],[3,6,5,9],[8,6,9,9],[10,6,11,9],[12,6,13,9],[22,6,23,9],[24,6,25,9],[14,1,15,4],[16,1,17,4],[18,11,19,14],[22,11,23,14],[24,11,25,14],[16,11,17,14],[18,6,19,9],[14,6,17,9],[18,1,19,4],[20,1,21,4]]}
["current version 2.8.6"]
[]
[]
[null,"Changes at 2.8.4",null,null,null,null,"Changes at 2.8.5",null,null,null,null,"Changes at 2.8.6"]
[]
[]
[null,"  - Nano DI Tree added",null,null,null,null,"  - Change log (NEWS) added into the Tool",null,null,null,null,"- Bug fixed when only a 1-wire reader was added (there was no Miniserver)"]
[]
[null,"  - thermal valve actuator 0-10V deleted ",null,null,null,null,"  - added Light circuit 5-16A in light category",null,null,null,null,"- Some missing translations were added"]
[]
[null,"  - Analog In (Reserve) added in sensor category",null,null,null,null,"  - added coupling relay to distribution category",null,null,null,null,"- Bug fixed, Air device channels from cathegory \"Sensors\" were not counted"]
[]
[null,"  - Feller Adapter Set added in CHE",null,null,null,null,"  - corrected price of weather service 10 years",null,null,null,null," - Window handle Air added"]
[]
[null,"  - adjusted international prices ",null,null,null,null," - new products added (Touch Pure anthracite, RGBW Dimmer Tree, new Spots)",null,null,null,null," - 2.8.6.'PRICE Window handle air + dimmer tree was not counted - fixed"]
[]
[]
[]
[null,null,null,null,null,null," - a few issues with blank cells were corrected"]

{"sheet":"Translating_general","index":20,"n_rows":164,"n_cols":39,"rows_kept":164,"cut":false,"hidden":true,"merged":[[1,0,1,14]]}
[]
["General Translating of the \"Eingabe\", \"Stückliste\", \"Netzteilrechner\"; \"Platzbedarfsrechner\" sheets => Normally you do this translation just once, Translating_products has to be updated constantly"]
[]
["Main"]
["DE","Stückzahl","Raumteilung","Licht","Beschattung","Heizung","Sensor","Air","Taster","Zutritt","Musik","Miniserver&Extension","Verteiler","Zubehör","Fans&Partner","Tree","Drop-Down-Menü Auswahl","Eingabe","Tree"]
["EN_UK","Quantity","Rooms","Lighting","Shading","Heating","Sensor","Air","Switches","Access","Music","Miniserver & Extension","Cabinet","Other","Fans & Partner","Tree","Drop Down Selection","Configuration","Tree"]
["EN_US","Quantity","Rooms","Light","Shading","Heating","Sensor","Air","Push-Buttons","Access","Music","Miniserver&Extension","Cabinet","Other","Fans&Partner","Tree","Drop Down Selection","Configuration","Tree"]
["FR","Quantité","Pièces","Eclairage","Ouvrants","Chauffage","Capteurs","Air","Boutons Poussoirs","Acccès","Audio","Miniserver&Extension","Tableau","Alimentations","Fans&Partenaires","Tree","Menu déroulant","Configuration","Tree"]
["ES","Número de unidades","Habitaciones","Iluminación","Sombreado","Climatización","Sensores","Air","Pulsadores","Acceso","Música","Miniserver y Extensiones","Conexión","Accesorios","Fans&Partner","Tree","Seleccinar del desplegable","Configuración","Tree"]
["CZ","Počet","Místnosti","Světlo","Stínění","Topení","Sensor","Air","Tlačítka","Přístup","Hudba","Miniserver&Extension","Rozvaděč","Příslušenství","Fanoušci a Partneři","Tree","Rozbalovací menu","Vyplňte","Tree"]
["IT","Quantità","Stanze","Illuminazione","Ombreggiatura","Riscaldamento","Sensori","Air","Pulsanti","Accesso","Musica","Miniserver & Extension","Distributore","Accessori","Fans & Partner","Tree","Scelta a menu drop-down","Immissione","Tree"]
["CHE","not translated yet","not translated yet","not translated yet","not translated yet","not translated yet","not translated yet","not translated yet","not translated yet","not translated yet","not translated yet","not translated yet","not translated yet","not translated yet","not translated yet","not translated yet","not translated yet","not translated yet","Tree"]
["SK","Počet","Místnosti","Světlo","Stínění","Topení","Sensor","Air","Tlačítka","Přístup","Hudba","Miniserver&Extension","Rozvaděč","Příslušenství","Fanoušci a Partneři","Tree","Rozbalovací menu","Vyplňte","Tree"]
["NL","Hoeveelheid","Ruimtes","Licht","Beschaduwing","Verwarming","Sensor","Air","Drukknoppen","Toegang","Muziek","Miniserver&Extension","Verdeelbord","Toebehoren","Fans&Partner","Tree","Drop-Down menu","Configuratie","Tree"]
["FI","not translated yet","not translated yet","not translated yet","not translated yet","not translated yet","not translated yet","not translated yet","not translated yet","not translated yet","not translated yet","not translated yet","not translated yet","not translated yet","not translated yet","not translated yet","not translated yet","not translated yet","Tree"]
["HU","not translated yet","not translated yet","not translated yet","not translated yet","not translated yet","not translated yet","not translated yet","not translated yet","not translated yet","not translated yet","not translated yet","not translated yet","not translated yet","not translated yet","not translated yet","not translated yet","not translated yet","Tree"]
["IE","not translated yet","not translated yet","not translated yet","not translated yet","not translated yet","not translated yet","not translated yet","not translated yet","not translated yet","not translated yet","not translated yet","not translated yet","not translated yet","not translated yet","not translated yet","not translated yet","not translated yet","Tree"]
["reservated",null,null,null,null,null,null,null,null,null,null,null,null,null,null,null,null,null,"to translate"]
["reservated",null,null,null,null,null,null,null,null,null,null,null,null,null,null,null,null,null,"to translate"]
["reservated",null,null,null,null,null,null,null,null,null,null,null,null,null,null,null,null,null,"to translate"]
["reservated",null,null,null,null,null,null,null,null,null,null,null,null,null,null,null,null,null,"to translate"]
["reservated",null,null,null,null,null,null,null,null,null,null,null,null,null,null,null,null,null,"to translate"]
[]
[]
[]
[]
[]
["Power"]
["DE","Netzteilrechner","Netzteile","Extensions","Artikelnummer","Produkte","Stück","Ampere/Stück","Gesamt","Ampere verfügbar","Ampere benötigt","Summe","LED","Peripherie","0,4 Ampere Netzteil/Stück"]
["EN_UK","Power Supply Calculator","Power Supplies","Extensions","Item number","Products","Quantity","Ampere/item","Total","Ampere available","Ampere needed","Total","LED","Periphery","0,4 Ampere Power Supply / item"]
["EN_US","Power Supply Calculator","Power Supplies","Extensions","Item number","Products","Quantity","Ampere/item","Total","Ampere available","Ampere needed","Total","LED","Periphery","0,4 Ampere Power Supply / item"]
["FR","Calcul d'Alimentation","Alimentation","Extensions","Référence","Produits","Quantité","Ampère/produit","Total","Ampère disponible","Ampère nécessaire","Total","LED","Periphérique","0,4 Ampère / produits"]
["ES","Calculadora de fuentes de alimentación","Fuentes de alimentación","Extensiones","Núm. de artículo","Productos","Unidades","Amperios/Ud.","Total","Amperios disponibles","Amperios necesarios","Total","LED","Periferia","0,4 Amperios F. Alimentación/Ud."]
["CZ","Výpočet zdroje","Zdroje","Extensiony","Číslo produktu","Produkty","Počet","Ampér/jednotku","Celkem","Zbývající Ampéry","Potřebné Ampéry","Celkem","LED","Příslušenství","0,4 Ampérový zdroj / jednotka"]
["IT","Calcolatore alimentatore","Alimentatori","Extensions","numero articolo","Prodotti","Pezzi","Ampere/pezzo","Totale","Ampere disponibile","Ampere necessita","Totale","LED","Periferia","0,4 Ampere alimentatore/pz"]
["CHE","Netzteilrechner","Netzteile","Extensions","Artikelnummer","Produkte","Stück","Ampere/Stück","Gesamt","Ampere verfügbar","Ampere benötigt","Summe","LED","Peripherie","0,4 Ampere Netzteil/Stück"]
["SK","Výpočet zdroje","Zdroje","Extensiony","Číslo produktu","Produkty","Počet","Ampér/jednotku","Celkem","Zbývající Ampéry","Potřebné Ampéry","Celkem","LED","Příslušenství","0,4 Ampérový zdroj / jednotka"]
["NL","Voeding calculator","Voeding","Extentions","Artikelnummer","Producten","Stuk","Ampère/Stuk","Totaal","Ampère beschikbaar","Ampère vereist","Totaal","LED","Toebehoren","0,4 Ampère Voeding / stuk"]
["FI","not translated yet","not translated yet","not translated yet","not translated yet","not translated yet","not translated yet","not translated yet","not translated yet","not translated yet","not translated yet","not translated yet","not translated yet","not translated yet","not translated yet"]
["HU","not translated yet","not translated yet","not translated yet","not translated yet","not translated yet","not translated yet","not translated yet","not translated yet","not translated yet","not translated yet","not translated yet","not translated yet","not translated yet","not translated yet"]
["IE","not translated yet","not translated yet","not translated yet","not translated yet","not translated yet","not translated yet","not translated yet","not translated yet","not translated yet","not translated yet","not translated yet","not translated yet","not translated yet","not translated yet"]
["reservated"]
["reservated"]
["reservated"]
["reservated"]
["reservated"]
[]
[]
[]
[]
[]
["Space"]
["DE","Platzbedarfsrechner","Artikelnummer","Produkte","Stück","Platzbedarf","Gesamt","Platzbedarf gesamt","Platzbedarf in mm","Platzbedarf in Teilungseinheiten"]
["EN_UK","Required Space Calculator","Item Numer","Products","Quantity","Required Space","Total","Total Space","Required Space in mm","Required Space in splitting units"]
["EN_US","Required Space Calculator","Item Numer","Products","Quantity","Required Space","Total","Total Space","Required Space in mm","Required Space in splitting units"]
["FR","Calcul Place Tableau","Référence","Produits","Quantité","Place nécessaire","Total","Place totale","Place nécessaire en mm","Place nécessaire en unité"]
["ES","Dimensionamiento","Nº de Arículo","Productos","Unidades","Espacio requerido","Total","Espacio necesario","Espacio necesario en mm","Espacio necesario en unidades DIN"]
["CZ","Výpočet požadovaného místa v rozvaděči","Číslo produktu","Produkty","Počet","Požadované místo","Celkem","Celkem místa","Požadované místo v mm","Počet modulů v rozvaděči"]
["IT","Calcolatore spazio","numero articolo","Prodotti","Pezzi","Spazio richiesto","Totale","Spazio totale","Spazio in mm","Spazio in unità di divisione"]
["CHE","not translated yet","not translated yet","not translated yet","not translated yet","not translated yet","not translated yet","not translated yet","not translated yet","not translated yet"]
["SK","Výpočet požadovaného místa v rozvaděči","Číslo produktu","Produkty","Počet","Požadované místo","Celkem","Celkem místa","Požadované místo v mm","Počet modulů v rozvaděči"]
["NL","Benodigde Ruimte Calculator","Artikelnummer","Producten","Stuk","Benodigde Ruimte","Totaal","Totale Ruimte","Benodigde Ruimte in mm","Benodigde Ruimte in Modules"]
["FI","not translated yet","not translated yet","not translated yet","not translated yet","not translated yet","not translated yet","not translated yet","not translated yet","not translated yet"]
["HU","not translated yet","not translated yet","not translated yet","not translated yet","not translated yet","not translated yet","not translated yet","not translated yet","not translated yet"]
["IE","not translated yet","not translated yet","not translated yet","not translated yet","not translated yet","not translated yet","not translated yet","not translated yet","not translated yet"]
["reservated"]
["reservated"]
["reservated"]
["reservated"]
["reservated"]
[]
[]
[]
[]
[]
["Products (general)",null,null,null,null,null,null,null,null,"set an ' otherwise excel thinks + is a function",null,null,null,null,null,null,null,null,null,null,null,null,null,null,null,null,null,null,null,null,null,null,"currency/Währung",null,"VAT in %",null,"do a '  before the minus otherwise it coutns as a forumula"]
["DE","Stückliste","Stück","Nr.","Beschreibung","Stück Netto","Stück Brutto","Gesamt","Gesamtpreis exkl. Steuern","+ Steuern","Gesamtpreis inkl. Steuern","Verfügbar","Benötigt","Reserve","Analoge Eingänge","Digitale Eingänge","Analoge Ausgänge","Digitale Ausgänge 5A","1-Wire Kanal","Air Base Kanäle","EnOcean","Digitale Ausgänge 16A","Dimmkanäle","Platzbedarf im Verteiler","in mm","in Teilungseinheiten","Netzteilrechner in Ampere","Extension","LED","Peripherie","Verfügbar","Bedarf","€","Treekanäle",20.0,"DE","Rabatt","Rabattierter Betrag"]
["EN_UK","Parts List","Quantity","No.","Description","Unit Net","Unit Gross","Total","Total excl. VAT","+ VAT","Total incl. VAT","Available","Required","Spare","Analogue Inputs","Digital Inputs","Analogue Outputs","Digital Outputs 5A","1-Wire Channel","Air Base Channels","EnOcean","Digital Outputs 16A","Dimmer Channels","Space Requirement Cabinett","in mm","in breaker units","Power Supply Calc. In Amps","Extension","LED","Peripherals","Available","Requried","£","Tree Channels",20.0,"EN_UK","Discount","Discounted Price"]
["EN_US","Parts List","Quantity","Nr.","Description","Unit Net","Unit Gross","Total","Total without taxes","+ Taxes","Total with taxes","Available","Needed","Left","Analog Inputs","Digital Inputs","Analog Outputs","Digital Outputs 5A","1-Wire Channel","Air Base Channels","Not available in this country","Digital Outputs 16A","Dimmer Channels","Space Requirement Cabinett","in mm","in splitting units","Powersupply Calc. In Ampere","Extension","LED","Periphery","Available","Needed","$","Tree Channels",null,"EN_US","Discount","Discounted Price"]
["FR","Liste de produits","Quantité","N°","Description","Pièce Net","Pièce Brut","Total","Total HT","+TVA","Total TTC","Disponible","Nécessaire","Restant","Entrées analogiques","Entrées numériques","Sorties analogiques","Sorties numériques 5A","canal 1-wire","canal Air Base","EnOcean","Sorties numériques 16A","Canal Dimmer","Espace nécessaire Tableau","en mm","en unité U","Calc Alimentation en Ampère","Extension","LED","Périphérique","Disponible","Nécessaire","€","Tree Channels",20.0,"FR","Discount","Discounted Price"]
["ES","Lista de productos","Unidades","Nº","Descripción","Precio sin IVA","Precio con IVA","Total","Precio total IVA no incluido","+ IVA","Precio total IVA incluido","Disponible","Necesario","Reserva","Entradas analógicas","Entradas digitales","Salidas analógicas","Salidas digitales 5A","Canales 1-Wire","Canales Air Base","EnoCean","Salidas digitales 16A","Canales dimmer","Espacio necesario en armario","en mm","En unidades de carril DIN","Calculadora de Fuentes de Alimentación (A)","Extensión","LED","Periferia","Disponible","Necesario","€","Canales Tree",21.0,"ES","Discount","Discounted Price"]
["CZ","Seznam produktů","Počet","č.","Popis","Cena za kus bez DPH","Cena za kus s DPH","Celkem","Celkem bez DPH","+ DPH","Celkem s DPH","Dostupné","Potřebné","Zbývající","Analogové vstupy","Digitální vstupy","Analogové výstupy","Digitální výstupy 5A","1-Wire zařízení","Air Base zařízení","EnOcean","Digitální výstupy 16A","Kanály Dimmeru","Požadované místo v rozvaděči","v mm","počet modulů","Výpočet zdroje v Ampérech","Extension","LED","Příslušenství","Dostupné","Potřebné","Kč","Tree Channels",21.0,"CZ","Discount","Discounted Price"]
["IT","Distinta","Pezzi","Nr.","Descrizione","Pezzo senza IVA","Pezzo con IVA","Totale","Prezzo totale senza IVA","+ IVA","Prezzo totale con IVA","Disponibile","Necessita","Riserva","Ingressi analogici","Ingressi digitali","Uscite analogiche","Uscite digitali 5A","Canale 1-Wire","Canali Air Base","EnOcean","Uscite digitali 16A","Canali dimmerabili","Spazio nel distributore","in mm","in unità di divisione","Calcolatore alimentatore in Ampere","Extension","LED","Periferia","Disponibile","Necessita","€","Canali Tree",22.0,"IT","Sconto","Importo senza sconto"]
["CHE","not translated yet","not translated yet","not translated yet","not translated yet","not translated yet","not translated yet","not translated yet","not translated yet","+ not translated yet","not translated yet","not translated yet","not translated yet","not translated yet","not translated yet","not translated yet","not translated yet","not translated yet","not translated yet","not translated yet","not translated yet","not translated yet","not translated yet","not translated yet","not translated yet","not translated yet","not translated yet","not translated yet","not translated yet","not translated yet","not translated yet","not translated yet","CHF","Tree Channels",8.0,"CHE","Discount","Discounted Price"]
["SK","Seznam produktů","Počet","č.","Popis","Cena za kus bez DPH","Cena za kus s DPH","Celkem","Celkem bez DPH","+ DPH","Celkem s DPH","Dostupné","Potřebné","Zbývající","Analogové vstupy","Digitální vstupy","Analogové výstupy","Digitální výstupy 5A","1-Wire zařízení","Air Base zařízení","EnOcean","Digitální výstupy 16A","Kanály Dimmeru","Požadované místo v rozvaděči","v mm","počet modulů","Výpočet zdroje v Ampérech","Extension","LED","Příslušenství","Dostupné","Potřebné","€","Tree Channels",20.0,"SK","Discount","Discounted Price"]
["NL","Onderdelenlijst","Aantal","Nr.","Omschrijving","Stuk Netto","Stuk Brutto","Totaal","to translate","+ BTW","Totaal met BTW","Beschikbaar","Benodigd","Reserve","Analoge Ingang","Digitale Ingang","Analoge Uitgang","Digitale Uitgang 5A","1-Wire Kanaal","Air Base Kanaal","EnoCean","Digitale Uitgang 16A","Dimmer Kanalen","Benodigde Ruimte in Verdeelbord","in mm","In Modules","Voeding Calculator in Ampère","Extension","LED","Toebehoren","Beschikbaar","Benodigd","€","Tree Channels",21.0,"NL","Discount","Discounted Price"]
["FI","not translated yet","not translated yet","not translated yet","not translated yet","not translated yet","not translated yet","not translated yet","not translated yet","not translated yet","not translated yet","not translated yet","not translated yet","not translated yet","not translated yet","not translated yet","not translated yet","not translated yet","not translated yet","not translated yet","not translated yet","not translated yet","not translated yet","not translated yet","not translated yet","not translated yet","not translated yet","not translated yet","not translated yet","not translated yet","not translated yet","not translated yet","not translated yet","Tree Channels",24.0,"FI","Discount","Discounted Price"]
["HU","not translated yet","not translated yet","not translated yet","not translated yet","not translated yet","not translated yet","not translated yet","not translated yet","not translated yet","not translated yet","not translated yet","not translated yet","not translated yet","not translated yet","not translated yet","not translated yet","not translated yet","not translated yet","not translated yet","not translated yet","not translated yet","not translated yet","not translated yet","not translated yet","not translated yet","not translated yet","not translated yet","not translated yet","not translated yet","not translated yet","not translated yet","not translated yet","Tree Channels",27.0,"HU","Discount","Discounted Price"]
["IE","not translated yet","not translated yet","not translated yet","not translated yet","not translated yet","not translated yet","not translated yet","not translated yet","not translated yet","not translated yet","not translated yet","not translated yet","not translated yet","not translated yet","not translated yet","not translated yet","not translated yet","not translated yet","not translated yet","not translated yet","not translated yet","not translated yet","not translated yet","not translated yet","not translated yet","not translated yet","not translated yet","not translated yet","not translated yet","not translated yet","not translated yet","not translated yet","Tree Channels",23.0,"IE","Discount","Discounted Price"]
["reservated",null,null,null,null,null,null,null,null,"to translate","to translate","to translate","to translate","to translate","to translate","to translate","to translate","to translate","to translate","to translate","to translate","to translate","to translate","to translate","to translate","to translate","to translate","to translate","to translate","to translate","to translate","to translate","to change","Tree Channels"]
["reservated",null,null,null,null,null,null,null,null,"to translate","to translate","to translate","to translate","to translate","to translate","to translate","to translate","to translate","to translate","to translate","to translate","to translate","to translate","to translate","to translate","to translate","to translate","to translate","to translate","to translate","to translate","to translate","to change","Tree Channels"]
["reservated",null,null,null,null,null,null,null,null,"to translate","to translate","to translate","to translate","to translate","to translate","to translate","to translate","to translate","to translate","to translate","to translate","to translate","to translate","to translate","to translate","to translate","to translate","to translate","to translate","to translate","to translate","to translate","to change","Tree Channels"]
["reservated",null,null,null,null,null,null,null,null,"to translate","to translate","to translate","to translate","to translate","to translate","to translate","to translate","to translate","to translate","to translate","to translate","to translate","to translate","to translate","to translate","to translate","to translate","to translate","to translate","to translate","to translate","to translate","to change","Tree Channels"]
["reservated",null,null,null,null,null,null,null,null,"to translate","to translate","to translate","to translate","to translate","to translate","to translate","to translate","to translate","to translate","to translate","to translate","to translate","to translate","to translate","to translate","to translate","to translate","to translate","to translate","to translate","to translate","to translate","to change","Tree Channels"]
[]
[]
[]
[]
[]
["Drop down (hidden pages)",null,null,null,null,null,null,null,null,null,null,null,null,null,null,"Just for inputs, not the real hardware"]
["DE","Dimmer Extension [Kanalauswahl]","Analog 1-10V","Lichtkreis schaltbar 5A/Verbraucher 5A","Lichtkreis dimmbar 230V","Lichtkreis Dimmbar 0-10V EVG","DMX Dimmkanal 50W","Air Dimmkanal 50W","1-Wire Temperaturfühler","Windsensor 24V (ben. Extension mit DI)","Fensterkontakt (im Fenster integriert; DI)","Verbraucher 5A","Verbraucher 5-16A","Beschattung (Rollo, Raffstore,...)",null,"Taster 1fach Digital","Taster 2fach Digital","Taster 4fach Digital","Taster 5fach Digital","Musikserver Zonenauswahl","Trennwand P-Reihe (10 Stk.)","Bezeichnungsträger P-Reihe (20 Stk.)","Abschlussplatte P-Reihe (10 Stk.)","Jalousie Anschlussklemme PMAK4 (50 Stk.)","Abschlussplatte PMAK4 (20 Stk.)","Installations- Reihenklemme PDL (50 Stk.)","Endwinkel ZEW 35 (20 Stk.)","Abschlussplatte PDL (20 Stk.)","Sicherungs-Reihenklemme (25 Stk.)","Abschlussplatte Sicherungskl. (50 Stk.) ","Querverbinder 24 Polig (10 Stk.)","Sicherung 2A (100 Stk.)","Sicherung 5A (100 Stk.)","Sicherung 10A (100 Stk.)","Loxone CAT7 Kabel (250m)",null,"Dali Kanal","Dali Kanäle","Verbraucher 16A"]
["EN_UK","Dimmer Channel (230V)","Analogue 1-10V","Light Circut (switched )","Light Circuit (dimmed 230V)","Light Circuit (dimmed 0-10V)","Light Circuit (24V 50W DMX)","Light Circuit (24V 50W Air)","1-Wire Temperature Sensor","Windsensor 24V","Window Contact (integrated - only reserve DI)","Other Load (5A)","Other Load (5-16A)","Shading (Blinds, Curtains, …)","to translate","Retractive  Switch 1 Button (reserve 1 DI)","Retractive  Switch 2 Buttons (reserve 2 DI)","Retractive  Switch 4 Buttons (reserve 4 DI)","Retractive  Switch 5 Buttons (reserve 5 DI)","Music Server Zone","Partition for 8x4 Terminals (10pcs)","Label Holder 8 Levels (20 pcs)","End Plate for 8x4 Terminals (10 pcs)","Push In Terminal Block 3+Earth (50 pcs)","End Plate for 3+Earth Terminals (20 pcs)","Push In Terminal Block Twin+Earth (50 pcs)","End Bracket (20 pcs)","End Plate for Twin+Earth Terminals (20 pcs)","Push in Fused Terminal Block (25 pcs)","End Plate For Fused Terminals (50 pcs)","Cross Connector For Fused Terminals (10 pcs)","Blade Fuse 2A (100 pcs)","Blade Fuse 5A (100 pcs)","Blade Fuse 10A (100 pcs)","Loxone CAT7 Cable (250m)","to translate","Dali Channel","Dali Channels","Circut (switched ) 16A"]
["EN_US","Dimmer Channel (110V)","Analogue 1-10V","Light Circut (switched )","Light Circuit (dimmed 110V)","Light Circuit (dimmed 0-10V)","Light Circuit (24V 50W DMX)","Light Circuit (24V 50W Air)","1-Wire Temperature Sensor","Windsensor 24V","Window Contact (integrated - only reserve DI)","Other Load (5A)","Other Load (5-16A)","Shading (Blinds, Curtains, …)","to translate","Retractive Wattstoper 1 Push button (reserve 1 DI)","Retractive  Wattstoper 2 Push buttons (reserve 2 DI)","Retractive  Wattstoper 4 Push buttons (reserve 4 DI)","Retractive  Wattstoper 5 Push buttons (reserve 5 DI)","Music Server Zone","Partition for 8x4 Terminals (10pcs)","Label Holder 8 Levels (20 pcs)","End Plate for 8x4 Terminals (10 pcs)","Push In Terminal Block 3+Earth (50 pcs)","End Plate for 3+Earth Terminals (20 pcs)","Push In Terminal Block Twin+Earth (50 pcs)","End Bracket (20 pcs)","End Plate for Twin+Earth Terminals (20 pcs)","Push in Fused Terminal Block (25 pcs)","End Plate For Fused Terminals (50 pcs)","Cross Connector For Fused Terminals (10 pcs)","Blade Fuse 2A (100 pcs)","Blade Fuse 5A (100 pcs)","Blade Fuse 10A (100 pcs)","Loxone CAT7 Cable (250m)","to translate","Dali Channel","Dali Channels","Circut (switched ) 16A"]
["FR","Canal dimmer (230V)","1-10V","Eclairage simple","Eclairage variation 230V","Eclairage 1-10V","Eclairage variation 24V DMX","Eclairage variation 24V Air","Sonde de temp 1-wire","Anémometre 24V","Contact d'ouverture intégré","Sortie numérique 5A","Sortie numérique 5-16A","Ouvrants (VR, stores ..)","not translated yet","BP 1 touche","BP 2 touches","BP 4 touches","BP 5 touches","Zone Music Server",null,"Porte étiquette (8 niveaux)","Plaque de fin pour bornier 8x4 (10pcs)","Bornier 3 + terre PMAK4 (50 pcs)"," Plaque de fin pour bornier 3 + terre PMAK4 (20 pcs)","Bornier 2 + Terre PDL  (50 pcs)","Délimitateur de rail Din (20 pcs)","Plaque de fin pour bornier 2 + terre PDL (20 pcs)","Bloc de terminal de fusible à connexion rapide (25 pcs)","Plaque de fin pour terminal de fusible (50 pcs)","Connecteur en croix pour terminal de fusible (10 pcs)","Fusible 2A (100 pcs)","Fusible 5A (100 pcs)","Fusible 10A (100 pcs)","Cat 7 250m","not translated yet","Dali Channel","Dali Channels","Eclairage simple 16A"]
["ES","Dimmer Extension [Canales]","Analógico 1-10V","Luminario ON/OFF 5A","Luminaria dimmer 230V","Luminaria dimmer 0-10V EVG","Canal dimmer DMX 50W","Canal dimmer Air 50W","Sensor de temperatura 1-Wire","Anemómetro 24V (necesaria entrada digital de Extension)","Contacto de ventana (integrado en ventana)","Consumidor 5A","Consumidor 5-16A","Sombreado (persiana, store,…)",null,"Pulsador digital 1 fase","Pulsador digital 2 fases","Pulsador digital 4 fases","Pulsador digital 5 fases","Music Server (seleccionar zonas)","Separador para bornes de Weidmüller (10Ud.)","Soporte de señalización para bornes (8 pisos) de Weidmüller (20Ud.)","Tapa final para borne 8x4 de Weidmüller (10Ud.)","Borne de 3 + tierra de Weidmüller","Tapa final para borne de 3 + tierra de Weidmüller (20Ud.)","Borne de 2 + tierra de Weidmüller (50Ud.)","Ángulo de fijación lateral de Weidmüller (20Ud.)","Tapa final para borne de 2 + tierra de Weidmüller (20Ud.)","Borne portafusibles de Weidmüller (25Ud.)","Tapa final para borne portafusibles de Weidmüller (50Ud.)","Conector transversal para borne portafusibles de Weidmüller (10Ud.)","Fusible 2A (100 unidades)","Fusible 5A (100 unidades)","Fusible 10A (100 unidades)","Cable CAT7 de Loxone","to translate","Canal Dali","Canales Dali","Luminario ON/OFF 16A"]
["CZ","Dimmer Extension (Výběr kanálu)","Analog 1-10V","Světelný okruh 5A","Stmívatelný okruh 230V","Stmívatelný okruh 0-10V s elektronickým předřadníkem","DMX Dimmer 50W na kanál","Air Dimmer kanál 50W","1-Wire teplotní senzor","Senzor rychlosti větru 24V (s digitálním vstupem na Extensionu)","Okenní kontakt (integrovaný v okně pouze DI)","Spotřebič do 5A","Spotřebič 5-16A","Stínění","to translate","1 Tlačítko","2 Tlačítko","4 Tlačítko","5 Tlačítko","Zóna Music Serveru","Předělovací deska PRV8 (10 ks)","Držák na značky pro PPV8/PRV8 (20ks)","Bočnice pro PPV8/PRV8 (10 ks)","Svorka na připojení motoru PMAK4 (50 ks)","Bočnice pro PMAK4 (20 ks)","Svorkovnice PDL (50ks)","Koncová podpěra svorkovnice ZEW (20 ks)","Bočnice pro PDL (20 ks)","Pojistková svorkovnice (25 ks)","Bočnice pojistkové svorkovnice (50 ks)","24 pólová propojka WEIDMÜLLER (10ks)","Pojistka 2A","Pojistka 5A (100ks)","Pojistka 10A (100ks)","Loxone CAT7 kabel (250m)","to translate","Dali Channel","Dali Channels","Světelný okruh 16A"]
["IT","Dimmer Extension [scelta canale]","Analogico 1-10V","Luce commutabile 5A","Luce dimmerabile 230V","Luce dimmerabile 0-10V","DMX canale dimmerabile 50W","Air canale dimmerabile 50W","Sensore temperatura 1-Wire","Sensore del vento 24V (rich. Extension con DI)","Contatto finestra (integrato nella finestra; DI)","Consumatore 5A","Consumatore 5-16A","Ombreggiatura (tapparelle, veneziane,...)","to translate","Pulsante digitale 1x","Pulsante digitale 2x","Pulsante digitale 4x","Pulsante digitale 5x","Music Server scelta canale","Piastra di separazione P-serie (10pz.)","Supporto per siglatura P-serie (20pz.)","Piastra terminale P-serie (10pz.)","Morsetto componibile colleg. motore PMAK4 (50pz.)","Piastra terminale PMAK4 (20pz.)","Morsetto per installazione ai piani PDL (50pz.)","Terminale di fissaggio ZEW 35 (20pz.)","Piastra terminale PDL (20pz.)","Morsetto componibile portafusibile (25pz.)","Piastra terminale portafusibile (50pz.)","Collegamento trasversale 24 poli (10pz.)","Fusibile 2A (100 pz.)","Fusibile 5A (100 pz.)","Fusibile 10A (100 pz.)","Loxone cavo CAT7 (250m)","to translate","Dali Channel","Dali Channels","Luce commutabile 16A"]
["CHE","not translated yet","not translated yet","not translated yet","not translated yet","not translated yet","not translated yet","not translated yet","not translated yet","not translated yet","not translated yet","not translated yet","not translated yet","not translated yet","not translated yet","not translated yet","not translated yet","not translated yet","not translated yet","not translated yet","not translated yet","not translated yet","not translated yet","not translated yet","not translated yet","not translated yet","not translated yet","not translated yet","not translated yet","not translated yet","not translated yet","not translated yet","not translated yet","not translated yet","not translated yet","not translated yet","Dali Channel","Dali Channels","not translated yet"]
["SK","Dimmer Extension (Výběr kanálu)","Analog 1-10V","Světelný okruh 5A","Stmívatelný okruh 230V","Stmívatelný okruh 0-10V s elektronickým předřadníkem","DMX Dimmer 50W na kanál","Air Dimmer kanál 50W","1-Wire teplotní senzor","Senzor rychlosti větru 24V (s digitálním vstupem na Extensionu)","Okenní kontakt (integrovaný v okně pouze DI)","Spotřebič do 5A","Spotřebič 5-16A","Stínění","to translate","1 Tlačítko","2 Tlačítko","4 Tlačítko","5 Tlačítko","Zóna Music Serveru","Předělovací deska PRV8 (10 ks)","Držák na značky pro PPV8/PRV8 (20ks)","Bočnice pro PPV8/PRV8 (10 ks)","Svorka na připojení motoru PMAK4 (50 ks)","Bočnice pro PMAK4 (20 ks)","Svorkovnice PDL (50ks)","Koncová podpěra svorkovnice ZEW (20 ks)","Bočnice pro PDL (20 ks)","Pojistková svorkovnice (25 ks)","Bočnice pojistkové svorkovnice (50 ks)","24 pólová propojka WEIDMÜLLER (10ks)","Pojistka 2A","Pojistka 5A (100ks)","Pojistka 10A (100ks)","Loxone CAT7 kabel (250m)","to translate","Dali Channel","Dali Channels","Světelný okruh 16A"]
["NL","Dimmer Extension [Kanaal keuze]","Analoog 1-10V","Lichtkring schakelbaar 5A","Lichtking dimmbaar 230V","Lichtkring dimmbaar 0-10V EVG","DMX Dimkanaal 50W","Air Dimkanaal 50W","1-Wire Temperatuurvoeler","Windsensor 24V (voor Extension met DI)","Raamcontact (in raam geïntegreerd; DI)","Verbruiker 5A","Verbruiker 5-16A","Beschaduwing (rolluik, lammellen,...)",null,"1-voudige digitale drukknop","2-voudige digitale drukknop","4-voudige digitale drukknop","5-voudige digitale drukknop","Muziek server zoneselectie","Scheidingswand P-serie (10 st.)","Markering houder P-serie (20 st.)","Afsluitplaat P-serie (10 st.)","Jaloezie afsluitplaat PMAK4 (50 st.)","Afsluitplaat PMAK4 (20 st.)","Installatie klem PDL (50 st.)","Eindklem ZEW 35 (20 st.)","Afsluitplaat PDL (20 st.)","Zekering klem (25 st.)","Afsluitplaat zekering klem (50 st.)","Kambrug voor klemmen 24 Polig (10 st.)","Zekering 2A (100 st.)","Zekering 5A (100 st.)","Zekering 10A (100 st.)","Loxone CAT7 Kabel (250m)",null,"Dali Channel","Dali Channels","Lichtkring schakelbaar 16A"]
["FI","not translated yet","not translated yet","not translated yet","not translated yet","not translated yet","not translated yet","not translated yet","not translated yet","not translated yet","not translated yet","not translated yet","not translated yet","not translated yet","not translated yet","not translated yet","not translated yet","not translated yet","not translated yet","not translated yet","not translated yet","not translated yet","not translated yet","not translated yet","not translated yet","not translated yet","not translated yet","not translated yet","not translated yet","not translated yet","not translated yet","not translated yet","not translated yet","not translated yet","not translated yet","not translated yet","Dali Channel","Dali Channels","not translated yet"]
["HU","not translated yet","not translated yet","not translated yet","not translated yet","not translated yet","not translated yet","not translated yet","not translated yet","not translated yet","not translated yet","not translated yet","not translated yet","not translated yet","not translated yet","not translated yet","not translated yet","not translated yet","not translated yet","not translated yet","not translated yet","not translated yet","not translated yet","not translated yet","not translated yet","not translated yet","not translated yet","not translated yet","not translated yet","not translated yet","not translated yet","not translated yet","not translated yet","not translated yet","not translated yet","not translated yet","Dali Channel","Dali Channels","not translated yet"]
["IE","not translated yet","not translated yet","not translated yet","not translated yet","not translated yet","not translated yet","not translated yet","not translated yet","not translated yet","not translated yet","not translated yet","not translated yet","not translated yet","not translated yet","not translated yet","not translated yet","not translated yet","not translated yet","not translated yet","not translated yet","not translated yet","not translated yet","not translated yet","not translated yet","not translated yet","not translated yet","not translated yet","not translated yet","not translated yet","not translated yet","not translated yet","not translated yet","not translated yet","not translated yet","not translated yet","Dali Channel","Dali Channels","not translated yet"]
["reservated","not translated yet","not translated yet","not translated yet","not translated yet","not translated yet","not translated yet","not translated yet","not translated yet","not translated yet","not translated yet","not translated yet","not translated yet","not translated yet","not translated yet","not translated yet","not translated yet","not translated yet","not translated yet","not translated yet","not translated yet","not translated yet","not translated yet","not translated yet","not translated yet","not translated yet","not translated yet","not translated yet","not translated yet","not translated yet","not translated yet","not translated yet","not translated yet","not translated yet","not translated yet","not translated yet","Dali Channel","Dali Channels","not translated yet"]
["reservated","not translated yet","not translated yet","not translated yet","not translated yet","not translated yet","not translated yet","not translated yet","not translated yet","not translated yet","not translated yet","not translated yet","not translated yet","not translated yet","not translated yet","not translated yet","not translated yet","not translated yet","not translated yet","not translated yet","not translated yet","not translated yet","not translated yet","not translated yet","not translated yet","not translated yet","not translated yet","not translated yet","not translated yet","not translated yet","not translated yet","not translated yet","not translated yet","not translated yet","not translated yet","not translated yet","Dali Channel","Dali Channels","not translated yet"]
["reservated","not translated yet","not translated yet","not translated yet","not translated yet","not translated yet","not translated yet","not translated yet","not translated yet","not translated yet","not translated yet","not translated yet","not translated yet","not translated yet","not translated yet","not translated yet","not translated yet","not translated yet","not translated yet","not translated yet","not translated yet","not translated yet","not translated yet","not translated yet","not translated yet","not translated yet","not translated yet","not translated yet","not translated yet","not translated yet","not translated yet","not translated yet","not translated yet","not translated yet","not translated yet","not translated yet","Dali Channel","Dali Channels","not translated yet"]
["reservated","not translated yet","not translated yet","not translated yet","not translated yet","not translated yet","not translated yet","not translated yet","not translated yet","not translated yet","not translated yet","not translated yet","not translated yet","not translated yet","not translated yet","not translated yet","not translated yet","not translated yet","not translated yet","not translated yet","not translated yet","not translated yet","not translated yet","not translated yet","not translated yet","not translated yet","not translated yet","not translated yet","not translated yet","not translated yet","not translated yet","not translated yet","not translated yet","not translated yet","not translated yet","not translated yet","Dali Channel","Dali Channels","not translated yet"]
["reservated","not translated yet","not translated yet","not translated yet","not translated yet","not translated yet","not translated yet","not translated yet","not translated yet","not translated yet","not translated yet","not translated yet","not translated yet","not translated yet","not translated yet","not translated yet","not translated yet","not translated yet","not translated yet","not translated yet","not translated yet","not translated yet","not translated yet","not translated yet","not translated yet","not translated yet","not translated yet","not translated yet","not translated yet","not translated yet","not translated yet","not translated yet","not translated yet","not translated yet","not translated yet","not translated yet","Dali Channel","Dali Channels","not translated yet"]
[]
[]
[]
[]
[]
["Message Box"]
["DE","Bitte entsprechende/n Verstärker manuell hinzufügen!","Bitte Dimmer (RGBW DMX/AIR) manuel hinzufügen je nach Lichtkreisen!"]
["EN_UK","Please add an amplifier manually!","Please add dimmer (dmx/air) manually due to your circuits!"]
["EN_US","Please add an amplifier manually!","Please add dimmer (dmx/air) manually due to your circuits!"]
["FR","Please add an amplifier manually!","Please add dimmer (dmx/air) manually due to your circuits!"]
["ES","Please add an amplifier manually!","Please add dimmer (dmx/air) manually due to your circuits!"]
["CZ","Please add an amplifier manually!","Please add dimmer (dmx/air) manually due to your circuits!"]
["IT","Si prega di aggiungere manualmente l'amplificatore!","Si prega di aggiungere manualmente il dimmer (RGBW DMX / AIR) secondo le luci commutabili!"]
["CHE","Please add an amplifier manually!","Please add dimmer (dmx/air) manually due to your circuits!"]
["SK","Please add an amplifier manually!","Please add dimmer (dmx/air) manually due to your circuits!"]
["NL","Please add an amplifier manually!","Please add dimmer (dmx/air) manually due to your circuits!"]
["FI","Please add an amplifier manually!","Please add dimmer (dmx/air) manually due to your circuits!"]
["HU","Please add an amplifier manually!","Please add dimmer (dmx/air) manually due to your circuits!"]
["IE","Please add an amplifier manually!","Please add dimmer (dmx/air) manually due to your circuits!"]
["reservated","Please add an amplifier manually!","Please add dimmer (dmx/air) manually due to your circuits!"]
["reservated","Please add an amplifier manually!","Please add dimmer (dmx/air) manually due to your circuits!"]
["reservated","Please add an amplifier manually!","Please add dimmer (dmx/air) manually due to your circuits!"]
["reservated","Please add an amplifier manually!","Please add dimmer (dmx/air) manually due to your circuits!"]
["reservated","Please add an amplifier manually!","Please add dimmer (dmx/air) manually due to your circuits!"]
[]
[]
[]
[]
["DE"]
["EN_UK"]
["EN_US"]
["FR"]
["ES"]
["CZ"]
["IT"]
["CHE"]
["SK"]
["NL"]
["FI"]
["HU"]
["IE"]
["reservated"]
["reservated"]
["reservated"]
["reservated"]
["reservated"]

{"sheet":"Message Box","index":21,"n_rows":3,"n_cols":3,"rows_kept":3,"cut":false,"hidden":true,"merged":[]}
[]
[null,"Verstärker:",{"$f":"VLOOKUP(Main!C2,Translating_general!A125:C142,2,FALSE)","v":"Please add an amplifier manually!"}]
[null,"Dimmer:",{"$f":"VLOOKUP(Main!C2,Translating_general!A125:C142,3,FALSE)","v":"Please add dimmer (dmx/air) manually due to your circuits!"}]

{"sheet":"Translating_products","index":22,"n_rows":224,"n_cols":151,"rows_kept":224,"cut":false,"hidden":true,"merged":[[0,69,0,70],[0,74,0,75],[0,79,0,80],[0,0,0,1],[0,5,0,6],[0,10,0,11],[0,15,0,16],[0,20,0,21],[0,55,0,56],[0,50,0,51],[0,30,0,31],[0,35,0,36],[0,40,0,41],[0,45,0,46],[0,59,0,60],[0,64,0,65],[0,25,0,26]]}
["DE",null,"PRICES WITH A , not a . ",null,null,"EN_UK",null,null,null,null,"EN_US",null,null,null,null,"FR",null,null,null,null,"ES",null,null,null,null,"CZ",null,null,null,null,"IT",null,null,null,null,"CHE",null,null,null,null,"SK",null,null,null,null,"NL",null,null,null,null,"FI",null,null,null,null,"HU",null,null,null,"IE",null,null,null,null,"reserviert",null,null,null,null,"reserviert",null,null,null,null,"reserviert",null,null,null,null,"reserviert"]
[null,"Info: DO NOT CHANGE THE ORDER OF THE LIST ",null,null,null,null,"Info: DO NOT CHANGE THE ORDER OF THE LIST ",null,null,null,null,"Info: DO NOT CHANGE THE ORDER OF THE LIST ",null,null,null,null,"Info: DO NOT CHANGE THE ORDER OF THE LIST ",null,null,null,null,"Info: DO NOT CHANGE THE ORDER OF THE LIST ",null,null,null,null,"Info: DO NOT CHANGE THE ORDER OF THE LIST ",null,null,null,null,"Info: DO NOT CHANGE THE ORDER OF THE LIST ",null,null,null,null,"Info: DO NOT CHANGE THE ORDER OF THE LIST ",null,null,null,null,"Info: DO NOT CHANGE THE ORDER OF THE LIST ",null,null,null,null,"Info: DO NOT CHANGE THE ORDER OF THE LIST ",null,null,null,null,"Info: DO NOT CHANGE THE ORDER OF THE LIST ",null,null,null,null,"Info: DO NOT CHANGE THE ORDER OF THE LIST ",null,null,null,"Info: DO NOT CHANGE THE ORDER OF THE LIST ",null,null,null,null,"Info: DO NOT CHANGE THE ORDER OF THE LIST ",null,null,null,null,"Info: DO NOT CHANGE THE ORDER OF THE LIST ",null,null,null,null,"Info: DO NOT CHANGE THE ORDER OF THE LIST ",null,null,null,null,"Info: DO NOT CHANGE THE ORDER OF THE LIST ",null,null,null,null,"DO ","NOT",null,null,null,null,"Just for the easier use of the function"]
["Art. Nr.","Name","Netto",null,null,"Item Nr.","Name","excl. Taxes",null,null,"Item Nr.","Name","excl. Taxes",null,null,"Item Nr.","Name","excl. Taxes",null,null,"Item Nr.","Name","excl. Taxes",null,null,"Item Nr.","Name","excl. Taxes",null,null,"Item Nr.","Name","excl. Taxes",null,null,"Item Nr.","Name","excl. Taxes",null,null,"Item Nr.","Name","excl. Taxes",null,null,"Item Nr.","Name","excl. Taxes",null,null,"Item Nr.","Name","excl. Taxes",null,null,"Item Nr.","Name","excl. Taxes",null,"Item Nr.","Name","excl. Taxes",null,null,"Item Nr.","Name","excl. Taxes",null,null,"Item Nr.","Name","excl. Taxes",null,null,"Item Nr.","Name","excl. Taxes",null,null,"Item Nr.","Name","excl. Taxes",null,null,null,"CHANGE","HERE",null,null,null,"Zeilennr.",{"$f":"A3","v":"Art. Nr."},{"$f":"F3","v":"Item Nr."},{"$f":"K3","v":"Item Nr."},{"$f":"P3","v":"Item Nr."},{"$f":"U3","v":"Item Nr."},{"$f":"Z3","v":"Item Nr."},{"$f":"AE3","v":"Item Nr."},{"$f":"AJ3","v":"Item Nr."},{"$f":"AO3","v":"Item Nr."},{"$f":"AT3","v":"Item Nr."},{"$f":"AY3","v":"Item Nr."},{"$f":"BD3","v":"Item Nr."},{"$f":"BH3","v":"Item Nr."},{"$f":"BM3","v":"Item Nr."},{"$f":"BR3","v":"Item Nr."},{"$f":"BW3","v":"Item Nr."},{"$f":"CB3","v":"Item Nr."},null,null,null,null,{"$f":"B3","v":"Name"},{"$f":"G3","v":"Name"},{"$f":"L3","v":"Name"},{"$f":"Q3","v":"Name"},{"$f":"V3","v":"Name"},{"$f":"$AA$3","v":"Name"},{"$f":"$AF$3","v":"Name"},{"$f":"$AK$3","v":"Name"},{"$f":"$AP$3","v":"Name"},{"$f":"$AU$3","v":"Name"},{"$f":"$AZ$3","v":"Name"},{"$f":"$BE$3","v":"Name"},{"$f":"$BI$3","v":"Name"},{"$f":"$BN$3","v":"Name"},{"$f":"$BS$3","v":"Name"},{"$f":"$BX$3","v":"Name"},{"$f":"$CC$3","v":"Name"},null,null,null,null,null,{"$f":"C3","v":"Netto"},{"$f":"H3","v":"excl. Taxes"},{"$f":"M3","v":"excl. Taxes"},{"$f":"R3","v":"excl. Taxes"},{"$f":"W3","v":"excl. Taxes"},{"$f":"AB3","v":"excl. Taxes"},{"$f":"AG3","v":"excl. Taxes"},{"$f":"AL3","v":"excl. Taxes"},{"$f":"AQ3","v":"excl. Taxes"},{"$f":"AV3","v":"excl. Taxes"},{"$f":"BA3","v":"excl. Taxes"},{"$f":"BF3","v":"excl. Taxes"},{"$f":"BJ3","v":"excl. Taxes"},{"$f":"BO3","v":"excl. Taxes"},{"$f":"BT3","v":"excl. Taxes"},{"$f":"BY3","v":"excl. Taxes"},{"$f":"CD3","v":"excl. Taxes"}]
["DE","DE","DE","DE is just for",null,"EN_UK","EN_UK","EN_UK",null,null,"EN_US","EN_US","EN_US",null,null,"FR","FR","FR",null,null,"ES","ES","ES",null,null,"CZ","CZ","CZ",null,null,"IT","IT","IT",null,null,"CHE","CHE","CHE",null,null,"SK","SK","SK",null,null,"NL","NL","NL",null,null,"FI","FI","FI",null,null,"HU","HU","HU",null,"IE","IE","IE",null,null,"name = how you select it in the lookup",null,null,null,null,"name = how you select it in the lookup",null,null,null,null,"name = how you select it in the lookup",null,null,null,null,"name = how you select it in the lookup",null,null,null,null,null,null,null,null,null,null,1.0,"DE","EN_UK","EN_US","FR","ES","CZ","IT","CHE","SK","NL","FI","HU","IE","name = how you select it in the lookup","name = how you select it in the lookup","name = how you select it in the lookup","name = how you select it in the lookup",null,null,null,null,"DE","EN_UK","EN_US","FR","ES",{"$f":"AA4","v":"CZ"},{"$f":"AF4","v":"IT"},{"$f":"AK4","v":"CHE"},{"$f":"AP4","v":"SK"},{"$f":"AU4","v":"NL"},{"$f":"AZ4","v":"FI"},{"$f":"BE4","v":"HU"},{"$f":"BI4","v":"IE"},{"$f":"BN4","v":""},{"$f":"BS4","v":""},{"$f":"BX4","v":""},{"$f":"CC4","v":""},null,null,null,null,null,"DE","EN_UK","EN_US","FR","ES","CZ","IT","CHE","SK","NL","FI","HU","IE","","","",""]
[100001.0,"Miniserver",415.0,"lookup function",null,100001.0,"Miniserver",357.5,null,null,100001.0,"Miniserver",549.0,null,null,100001.0,"Miniserver",415.0,null,null,100001.0,"Miniserver",415.0,null,null,100001.0,"Miniserver",10329.75,null,null,100001.0,"Miniserver",415.0,null,null,100001.0,"Miniserver",489.82,null,null,100001.0,"Miniserver",415.0,null,null,100001.0,"Miniserver",415.0,null,null,"Not done","not translated yet","Not done",null,null,"Not done","not translated yet","Not done",null,"Not done","not translated yet","Not done",null,null,"Not done","not translated yet","Not done",null,null,"Not done","not translated yet","Not done",null,null,"Not done","not translated yet","Not done",null,null,"Not done","not translated yet","Not done",null,null,null,null,null,null,null,null,2.0,100001,100001,100001,100001,100001,100001,100001,100001,100001,100001,"Not done","Not done","Not done","Not done","Not done","Not done","Not done",null,null,null,null,"Miniserver","Miniserver","Miniserver","Miniserver","Miniserver","Miniserver","Miniserver","Miniserver","Miniserver","Miniserver","not translated yet","not translated yet","not translated yet","not translated yet","not translated yet","not translated yet","not translated yet",null,null,null,null,null,415,357.5,549,415,415,10329.75,415,489.82,415,415,"Not done","Not done","Not done","Not done","Not done","Not done","Not done"]
[100002.0,"Extension",331.67,null,null,100002.0,"Extension",282.5,null,null,100002.0,"Extension",449.0,null,null,100002.0,"Extension",331.67,null,null,100002.0,"Extension",331.67,null,null,100002.0,"Extension",8263.64,null,null,100002.0,"Extension",331.67,null,null,100002.0,"Extension",406.48,null,null,100002.0,"Extension",331.67,null,null,100002.0,"Extension",331.67,null,null,"Not done","not translated yet","Not done",null,null,"Not done","not translated yet","Not done",null,"Not done","not translated yet","Not done",null,null,"Not done","not translated yet","Not done",null,null,"Not done","not translated yet","Not done",null,null,"Not done","not translated yet","Not done",null,null,"Not done","not translated yet","Not done",null,null,null,null,null,null,null,null,3.0,100002,100002,100002,100002,100002,100002,100002,100002,100002,100002,"Not done","Not done","Not done","Not done","Not done","Not done","Not done",null,null,null,null,"Extension","Extension","Extension","Extension","Extension","Extension","Extension","Extension","Extension","Extension","not translated yet","not translated yet","not translated yet","not translated yet","not translated yet","not translated yet","not translated yet",null,null,null,null,null,331.67,282.5,449,331.67,331.67,8263.64,331.67,406.48,331.67,331.67,"Not done","Not done","Not done","Not done","Not done","Not done","Not done"]
[100004.0,"Rollup Aufsteller",190.0,null,null,100005.0,"Rollup Banner English",82.5,null,null,100005.0,"Rollup Banner English",119.0,null,null,100046.0,"Rollup FR",190.0,null,null,100004.0,"Rollup Loxone",190.0,null,null,100040.0,"Rollup český",2699.0,null,null,100004.0,"Rollup Espositore",190.0,null,null,100004.0,"Rollup Aufsteller",119.44,null,null,100040.0,"Rollup český",190.0,null,null,100042.0,"Rollup Banner Nederlands",190.0,null,null,"Not done","not translated yet","Not done",null,null,"Not done","not translated yet","Not done",null,"Not done","not translated yet","Not done",null,null,"Not done","not translated yet","Not done",null,null,"Not done","not translated yet","Not done",null,null,"Not done","not translated yet","Not done",null,null,"Not done","not translated yet","Not done",null,null,null,null,null,null,null,null,4.0,100004,100005,100005,100046,100004,100040,100004,100004,100040,100042,"Not done","Not done","Not done","Not done","Not done","Not done","Not done",null,null,null,null,"Rollup Aufsteller","Rollup Banner English","Rollup Banner English","Rollup FR","Rollup Loxone","Rollup český","Rollup Espositore","Rollup Aufsteller","Rollup český","Rollup Banner Nederlands","not translated yet","not translated yet","not translated yet","not translated yet","not translated yet","not translated yet","not translated yet",null,null,null,null,null,190,82.5,119,190,190,2699,190,119.44,190,190,"Not done","Not done","Not done","Not done","Not done","Not done","Not done"]
[100008.0,"SD-Karte mit Firmware",9.92,null,null,100008.0,"Micro SD Card with firmware",8.75,null,null,100008.0,"Micro SD Card with firmware",14.0,null,null,100008.0,"Micro SD Card avec firmware",9.92,null,null,100008.0,"Tarjeta SD con Firmware",9.92,null,null,100008.0,"SD-Karta s firmwarem",247.11,null,null,100008.0,"Scheda SD con Firmware",9.92,null,null,100008.0,"SD-Karte mit Firmware",11.99,null,null,100008.0,"SD-Karta s firmwarem",9.92,null,null,100008.0,"Micro SD Kaart met firmware",9.92,null,null,"Not done","not translated yet","Not done",null,null,"Not done","not translated yet","Not done",null,"Not done","not translated yet","Not done",null,null,"Not done","not translated yet","Not done",null,null,"Not done","not translated yet","Not done",null,null,"Not done","not translated yet","Not done",null,null,"Not done","not translated yet","Not done",null,null,null,null,null,null,null,null,5.0,100008,100008,100008,100008,100008,100008,100008,100008,100008,100008,"Not done","Not done","Not done","Not done","Not done","Not done","Not done",null,null,null,null,"SD-Karte mit Firmware","Micro SD Card with firmware","Micro SD Card with firmware","Micro SD Card avec firmware","Tarjeta SD con Firmware","SD-Karta s firmwarem","Scheda SD con Firmware","SD-Karte mit Firmware","SD-Karta s firmwarem","Micro SD Kaart met firmware","not translated yet","not translated yet","not translated yet","not translated yet","not translated yet","not translated yet","not translated yet",null,null,null,null,null,9.92,8.75,14,9.92,9.92,247.11,9.92,11.99,9.92,9.92,"Not done","Not done","Not done","Not done","Not done","Not done","Not done"]
[100011.0,"RS485 Extension",140.84,null,null,100011.0,"RS485 Extension",122.5,null,null,100011.0,"RS485 Extension",199.0,null,null,100011.0,"Extension RS485",140.84,null,null,100011.0,"RS485 Extension",140.84,null,null,100011.0,"RS485 Extension",3511.57,null,null,100011.0,"RS485 Extension",140.84,null,null,100011.0,"RS485 Extension",175.0,null,null,100011.0,"RS485 Extension",140.84,null,null,100011.0,"RS485 Extension",140.84,null,null,"Not done","not translated yet","Not done",null,null,"Not done","not translated yet","Not done",null,"Not done","not translated yet","Not done",null,null,"Not done","not translated yet","Not done",null,null,"Not done","not translated yet","Not done",null,null,"Not done","not translated yet","Not done",null,null,"Not done","not translated yet","Not done",null,null,null,null,null,null,null,null,6.0,100011,100011,100011,100011,100011,100011,100011,100011,100011,100011,"Not done","Not done","Not done","Not done","Not done","Not done","Not done",null,null,null,null,"RS485 Extension","RS485 Extension","RS485 Extension","Extension RS485","RS485 Extension","RS485 Extension","RS485 Extension","RS485 Extension","RS485 Extension","RS485 Extension","not translated yet","not translated yet","not translated yet","not translated yet","not translated yet","not translated yet","not translated yet",null,null,null,null,null,140.84,122.5,199,140.84,140.84,3511.57,140.84,175,140.84,140.84,"Not done","Not done","Not done","Not done","Not done","Not done","Not done"]
[100012.0,"DMX Extension",224.17,null,null,100012.0,"DMX Extension",197.5,null,null,100012.0,"DMX Extension",299.0,null,null,100012.0,"Extension DMX",224.17,null,null,100012.0,"DMX Extension",224.17,null,null,100012.0,"DMX Extension",5619.01,null,null,100012.0,"DMX Extension",224.17,null,null,100012.0,"DMX Extension",276.85,null,null,100012.0,"DMX Extension",224.17,null,null,100012.0,"DMX Extension",224.17,null,null,"Not done","not translated yet","Not done",null,null,"Not done","not translated yet","Not done",null,"Not done","not translated yet","Not done",null,null,"Not done","not translated yet","Not done",null,null,"Not done","not translated yet","Not done",null,null,"Not done","not translated yet","Not done",null,null,"Not done","not translated yet","Not done",null,null,null,null,null,null,null,null,7.0,100012,100012,100012,100012,100012,100012,100012,100012,100012,100012,"Not done","Not done","Not done","Not done","Not done","Not done","Not done",null,null,null,null,"DMX Extension","DMX Extension","DMX Extension","Extension DMX","DMX Extension","DMX Extension","DMX Extension","DMX Extension","DMX Extension","DMX Extension","not translated yet","not translated yet","not translated yet","not translated yet","not translated yet","not translated yet","not translated yet",null,null,null,null,null,224.17,197.5,299,224.17,224.17,5619.01,224.17,276.85,224.17,224.17,"Not done","Not done","Not done","Not done","Not done","Not done","Not done"]
[100013.0,"RS232 Extension",140.84,null,null,100013.0,"RS 232 Extension",122.5,null,null,100013.0,"RS 232 Extension",199.0,null,null,100013.0,"Extension RS 232",140.84,null,null,100013.0,"RS232 Extension",140.84,null,null,100013.0,"RS 232 Extension",3511.57,null,null,100013.0,"RS232 Extension",140.84,null,null,100013.0,"RS232 Extension",175.0,null,null,100013.0,"RS 232 Extension",140.84,null,null,100013.0,"RS 232 Extension",140.84,null,null,"Not done","not translated yet","Not done",null,null,"Not done","not translated yet","Not done",null,"Not done","not translated yet","Not done",null,null,"Not done","not translated yet","Not done",null,null,"Not done","not translated yet","Not done",null,null,"Not done","not translated yet","Not done",null,null,"Not done","not translated yet","Not done",null,null,null,null,null,null,null,null,8.0,100013,100013,100013,100013,100013,100013,100013,100013,100013,100013,"Not done","Not done","Not done","Not done","Not done","Not done","Not done",null,null,null,null,"RS232 Extension","RS 232 Extension","RS 232 Extension","Extension RS 232","RS232 Extension","RS 232 Extension","RS232 Extension","RS232 Extension","RS 232 Extension","RS 232 Extension","not translated yet","not translated yet","not translated yet","not translated yet","not translated yet","not translated yet","not translated yet",null,null,null,null,null,140.84,122.5,199,140.84,140.84,3511.57,140.84,175,140.84,140.84,"Not done","Not done","Not done","Not done","Not done","Not done","Not done"]
[100014.0,"1-wire Extension",140.84,null,null,100014.0,"1-Wire Extension",122.5,null,null,100014.0,"1-Wire Extension",199.0,null,null,100014.0,"Extension 1-Wire",140.84,null,null,100014.0,"1-wire Extension",140.84,null,null,100014.0,"1-Wire Extension",3511.57,null,null,100014.0,"1-wire Extension",140.84,null,null,100014.0,"1-wire Extension",175.0,null,null,100014.0,"1-Wire Extension",140.84,null,null,100014.0,"1-Wire Extension",140.84,null,null,"Not done","not translated yet","Not done",null,null,"Not done","not translated yet","Not done",null,"Not done","not translated yet","Not done",null,null,"Not done","not translated yet","Not done",null,null,"Not done","not translated yet","Not done",null,null,"Not done","not translated yet","Not done",null,null,"Not done","not translated yet","Not done",null,null,null,null,null,null,null,null,9.0,100014,100014,100014,100014,100014,100014,100014,100014,100014,100014,"Not done","Not done","Not done","Not done","Not done","Not done","Not done",null,null,null,null,"1-wire Extension","1-Wire Extension","1-Wire Extension","Extension 1-Wire","1-wire Extension","1-Wire Extension","1-wire Extension","1-wire Extension","1-Wire Extension","1-Wire Extension","not translated yet","not translated yet","not translated yet","not translated yet","not translated yet","not translated yet","not translated yet",null,null,null,null,null,140.84,122.5,199,140.84,140.84,3511.57,140.84,175,140.84,140.84,"Not done","Not done","Not done","Not done","Not done","Not done","Not done"]
[100015.0,"EnOcean Extension",249.17,null,null,100015.0,"Enocean Extension",212.5,null,null,"not available in this country","not available in this country",0.0,null,null,100015.0,"Extension Enocean",249.17,null,null,100015.0,"EnOcean Extension",249.17,null,null,100015.0,"Enocean Extension",6197.52,null,null,100015.0,"EnOcean Extension",249.17,null,null,100015.0,"EnOcean Extension",310.19,null,null,100015.0,"Enocean Extension",249.17,null,null,100015.0,"Enocean Extension",249.17,null,null,"Not done","not translated yet","Not done",null,null,"Not done","not translated yet","Not done",null,"Not done","not translated yet","Not done",null,null,"Not done","not translated yet","Not done",null,null,"Not done","not translated yet","Not done",null,null,"Not done","not translated yet","Not done",null,null,"Not done","not translated yet","Not done",null,null,null,null,null,null,null,null,10.0,100015,100015,"not available in this country",100015,100015,100015,100015,100015,100015,100015,"Not done","Not done","Not done","Not done","Not done","Not done","Not done",null,null,null,null,"EnOcean Extension","Enocean Extension","not available in this country","Extension Enocean","EnOcean Extension","Enocean Extension","EnOcean Extension","EnOcean Extension","Enocean Extension","Enocean Extension","not translated yet","not translated yet","not translated yet","not translated yet","not translated yet","not translated yet","not translated yet",null,null,null,null,null,249.17,212.5,0,249.17,249.17,6197.52,249.17,310.19,249.17,249.17,"Not done","Not done","Not done","Not done","Not done","Not done","Not done"]
[100023.0,"IR Module",65.83,null,null,0.0,"No longer sold",57.5,null,null,"No longer sold","No longer sold",0.0,null,null,100023.0,"IR Module",65.83,null,null,100023.0,"Módulo IR",65.83,null,null,100023.0,"IR Modul",1652.07,null,null,100023.0,"Modulo IR",65.83,null,null,100023.0,"IR Module",88.84,null,null,100023.0,"IR Modul",65.83,null,null,100023.0,"IR Module",65.83,null,null,"Not done","not translated yet","Not done",null,null,"Not done","not translated yet","Not done",null,"Not done","not translated yet","Not done",null,null,"Not done","not translated yet","Not done",null,null,"Not done","not translated yet","Not done",null,null,"Not done","not translated yet","Not done",null,null,"Not done","not translated yet","Not done",null,null,null,null,null,null,null,null,11.0,100023,0,"No longer sold",100023,100023,100023,100023,100023,100023,100023,"Not done","Not done","Not done","Not done","Not done","Not done","Not done",null,null,null,null,"IR Module","No longer sold","No longer sold","IR Module","Módulo IR","IR Modul","Modulo IR","IR Module","IR Modul","IR Module","not translated yet","not translated yet","not translated yet","not translated yet","not translated yet","not translated yet","not translated yet",null,null,null,null,null,65.83,57.5,0,65.83,65.83,1652.07,65.83,88.84,65.83,65.83,"Not done","Not done","Not done","Not done","Not done","Not done","Not done"]
[100025.0,"Cloud Weather 1 Jahr",49.92,null,null,100025.0,"Weather Service 1 Year",42.5,null,null,100025.0,"Weather Service 1 Year",69.0,null,null,100025.0,"Service météo 1 an",49.92,null,null,100025.0,"Servico Meteorológico 1 año",49.92,null,null,100025.0,"Weather Service 1 rok",1238.84,null,null,100025.0,"Cloud Weather 1 anno",49.92,null,null,100025.0,"Cloud Weather 1 Jahr",64.77,null,null,100025.0,"Weather Service 1 rok",49.92,null,null,100025.0,"Weather Service 1 Jaar",49.92,null,null,"Not done","not translated yet","Not done",null,null,"Not done","not translated yet","Not done",null,"Not done","not translated yet","Not done",null,null,"Not done","not translated yet","Not done",null,null,"Not done","not translated yet","Not done",null,null,"Not done","not translated yet","Not done",null,null,"Not done","not translated yet","Not done",null,null,null,null,null,null,null,null,12.0,100025,100025,100025,100025,100025,100025,100025,100025,100025,100025,"Not done","Not done","Not done","Not done","Not done","Not done","Not done",null,null,null,null,"Cloud Weather 1 Jahr","Weather Service 1 Year","Weather Service 1 Year","Service météo 1 an","Servico Meteorológico 1 año","Weather Service 1 rok","Cloud Weather 1 anno","Cloud Weather 1 Jahr","Weather Service 1 rok","Weather Service 1 Jaar","not translated yet","not translated yet","not translated yet","not translated yet","not translated yet","not translated yet","not translated yet",null,null,null,null,null,49.92,42.5,69,49.92,49.92,1238.84,49.92,64.77,49.92,49.92,"Not done","Not done","Not done","Not done","Not done","Not done","Not done"]
[100201.0,"Cloud Weather 10 Jahre",290.83,null,null,100201.0,"Weather Service 10 Year",240.0,null,null,100201.0,"Weather Service 10 Year",325.0,null,null,100201.0,"Service météo 10 ans",279.2,null,null,100201.0,"Servico Meteorológico 10 años",279.2,null,null,100201.0,"Weather Service 10 let",7899.0,null,null,100201.0,"Cloud Weather 10 anno",279.2,null,null,100201.0,"Cloud Weather 10 Jahre",369.44,null,null,100201.0,"Weather Service 10 let",279.2,null,null,100201.0,"Weather Service 10 Jaar",279.2,null,null,"Not done","not translated yet","Not done",null,null,"Not done","not translated yet","Not done",null,"Not done","not translated yet","Not done",null,null,"Not done","not translated yet","Not done",null,null,"Not done","not translated yet","Not done",null,null,"Not done","not translated yet","Not done",null,null,"Not done","not translated yet","Not done",null,null,null,null,null,null,null,null,13.0,100201,100201,100201,100201,100201,100201,100201,100201,100201,100201,"Not done","Not done","Not done","Not done","Not done","Not done","Not done",null,null,null,null,"Cloud Weather 10 Jahre","Weather Service 10 Year","Weather Service 10 Year","Service météo 10 ans","Servico Meteorológico 10 años","Weather Service 10 let","Cloud Weather 10 anno","Cloud Weather 10 Jahre","Weather Service 10 let","Weather Service 10 Jaar","not translated yet","not translated yet","not translated yet","not translated yet","not translated yet","not translated yet","not translated yet",null,null,null,null,null,290.83,240,325,279.2,279.2,7899,279.2,369.44,279.2,279.2,"Not done","Not done","Not done","Not done","Not done","Not done","Not done"]
[100027.0,"Cloud Caller 1 Jahr",49.92,null,null,100027.0,"Caller Service 1 Year",47.5,null,null,100027.0,"Caller Service 1 Year",69.0,null,null,100027.0,"Caller Service 1 an",49.92,null,null,100027.0,"Servicio de Llamadas 1 año",49.92,null,null,100027.0,"Caller Service 1 rok",1238.84,null,null,100027.0,"Cloud Caller 1 anno",49.92,null,null,100027.0,"Cloud Caller 1 Jahr",64.77,null,null,100027.0,"Caller Service 1 rok",49.92,null,null,100027.0,"Caller Service 1 Jaar",49.92,null,null,"Not done","not translated yet","Not done",null,null,"Not done","not translated yet","Not done",null,"Not done","not translated yet","Not done",null,null,"Not done","not translated yet","Not done",null,null,"Not done","not translated yet","Not done",null,null,"Not done","not translated yet","Not done",null,null,"Not done","not translated yet","Not done",null,null,null,null,null,null,null,null,14.0,100027,100027,100027,100027,100027,100027,100027,100027,100027,100027,"Not done","Not done","Not done","Not done","Not done","Not done","Not done",null,null,null,null,"Cloud Caller 1 Jahr","Caller Service 1 Year","Caller Service 1 Year","Caller Service 1 an","Servicio de Llamadas 1 año","Caller Service 1 rok","Cloud Caller 1 anno","Cloud Caller 1 Jahr","Caller Service 1 rok","Caller Service 1 Jaar","not translated yet","not translated yet","not translated yet","not translated yet","not translated yet","not translated yet","not translated yet",null,null,null,null,null,49.92,47.5,69,49.92,49.92,1238.84,49.92,64.77,49.92,49.92,"Not done","Not done","Not done","Not done","Not done","Not done","Not done"]
[100202.0,"Cloud Caller 10 Jahre",290.83,null,null,100028.0,"Caller Service 10 Years",240.0,null,null,100028.0,"Caller Service 10 Years",325.0,null,null,100028.0,"Caller Service 3 ans",290.83,null,null,100028.0,"Servicio de Llamadas 10 años",290.83,null,null,100028.0,"Caller Service 10 let",7899.0,null,null,100028.0,"Cloud Caller 3 anni",141.59,null,null,100028.0,"Cloud Caller 3 Jahre",165.74,null,null,100028.0,"Caller Service 10 let",279.2,null,null,100028.0,"Caller Service 3 Jaar",141.59,null,null,"Not done","not translated yet","Not done",null,null,"Not done","not translated yet","Not done",null,"Not done","not translated yet","Not done",null,null,"Not done","not translated yet","Not done",null,null,"Not done","not translated yet","Not done",null,null,"Not done","not translated yet","Not done",null,null,"Not done","not translated yet","Not done",null,null,null,null,null,null,null,null,15.0,100202,100028,100028,100028,100028,100028,100028,100028,100028,100028,"Not done","Not done","Not done","Not done","Not done","Not done","Not done",null,null,null,null,"Cloud Caller 10 Jahre","Caller Service 10 Years","Caller Service 10 Years","Caller Service 3 ans","Servicio de Llamadas 10 años","Caller Service 10 let","Cloud Caller 3 anni","Cloud Caller 3 Jahre","Caller Service 10 let","Caller Service 3 Jaar","not translated yet","not translated yet","not translated yet","not translated yet","not translated yet","not translated yet","not translated yet",null,null,null,null,null,290.83,240,325,290.83,290.83,7899,141.59,165.74,279.2,141.59,"Not done","Not done","Not done","Not done","Not done","Not done","Not done"]
[100029.0,"Dimmer Extension",373.33,null,null,100029.0,"Dimmer Extension",322.5,null,null,100029.0,"Dimmer Extension",499.0,null,null,100029.0,"Extension Dimmer",373.33,null,null,100029.0,"Dimmer Extension",373.33,null,null,100029.0,"Dimmer Extension",9338.02,null,null,100029.0,"Dimmer Extension",373.33,null,null,100029.0,"Dimmer Extension",452.78,null,null,100029.0,"Dimmer Extension",373.33,null,null,100029.0,"Dimmer Extension",373.33,null,null,"Not done","not translated yet","Not done",null,null,"Not done","not translated yet","Not done",null,"Not done","not translated yet","Not done",null,null,"Not done","not translated yet","Not done",null,null,"Not done","not translated yet","Not done",null,null,"Not done","not translated yet","Not done",null,null,"Not done","not translated yet","Not done",null,null,null,null,null,null,null,null,16.0,100029,100029,100029,100029,100029,100029,100029,100029,100029,100029,"Not done","Not done","Not done","Not done","Not done","Not done","Not done",null,null,null,null,"Dimmer Extension","Dimmer Extension","Dimmer Extension","Extension Dimmer","Dimmer Extension","Dimmer Extension","Dimmer Extension","Dimmer Extension","Dimmer Extension","Dimmer Extension","not translated yet","not translated yet","not translated yet","not translated yet","not translated yet","not translated yet","not translated yet",null,null,null,null,null,373.33,322.5,499,373.33,373.33,9338.02,373.33,452.78,373.33,373.33,"Not done","Not done","Not done","Not done","Not done","Not done","Not done"]
[100035.0,"IR Set",165.83,null,null,0.0,"No longer sold",147.5,null,null,100035.0,"IR Set",229.0,null,null,100035.0,"Kit IR",165.83,null,null,100035.0,"IR Set",165.83,null,null,100035.0,"IR Set",4131.4,null,null,100035.0,"IR Set",165.83,null,null,100035.0,"IR Set",221.3,null,null,100035.0,"IR Set",165.83,null,null,100035.0,"IR Set",165.83,null,null,"Not done","not translated yet","Not done",null,null,"Not done","not translated yet","Not done",null,"Not done","not translated yet","Not done",null,null,"Not done","not translated yet","Not done",null,null,"Not done","not translated yet","Not done",null,null,"Not done","not translated yet","Not done",null,null,"Not done","not translated yet","Not done",null,null,null,null,null,null,null,null,17.0,100035,0,100035,100035,100035,100035,100035,100035,100035,100035,"Not done","Not done","Not done","Not done","Not done","Not done","Not done",null,null,null,null,"IR Set","No longer sold","IR Set","Kit IR","IR Set","IR Set","IR Set","IR Set","IR Set","IR Set","not translated yet","not translated yet","not translated yet","not translated yet","not translated yet","not translated yet","not translated yet",null,null,null,null,null,165.83,147.5,229,165.83,165.83,4131.4,165.83,221.3,165.83,165.83,"Not done","Not done","Not done","Not done","Not done","Not done","Not done"]
[100038.0,"Relay Extension",395.0,null,null,100038.0,"Relay Extension",332.5,null,null,100038.0,"Relay Extension",539.0,null,null,100038.0,"Extension Relay",395.0,null,null,100038.0,"Relay Extension",395.0,null,null,100038.0,"Relay Extension",9916.53,null,null,100038.0,"Relay Extension",395.0,null,null,100038.0,"Relay Extension",489.82,null,null,100038.0,"Relay Extension",395.0,null,null,100038.0,"Relay Extension",395.0,null,null,"Not done","not translated yet","Not done",null,null,"Not done","not translated yet","Not done",null,"Not done","not translated yet","Not done",null,null,"Not done","not translated yet","Not done",null,null,"Not done","not translated yet","Not done",null,null,"Not done","not translated yet","Not done",null,null,"Not done","not translated yet","Not done",null,null,null,null,null,null,null,null,18.0,100038,100038,100038,100038,100038,100038,100038,100038,100038,100038,"Not done","Not done","Not done","Not done","Not done","Not done","Not done",null,null,null,null,"Relay Extension","Relay Extension","Relay Extension","Extension Relay","Relay Extension","Relay Extension","Relay Extension","Relay Extension","Relay Extension","Relay Extension","not translated yet","not translated yet","not translated yet","not translated yet","not translated yet","not translated yet","not translated yet",null,null,null,null,null,395,332.5,539,395,395,9916.53,395,489.82,395,395,"Not done","Not done","Not done","Not done","Not done","Not done","Not done"]
[100114.0,"Air Base Extension",82.5,null,null,100114.0,"Air Base Extension",72.5,null,null,100114.0,"Air Base Extension",113.0,null,null,100114.0,"Extension Air Base",82.5,null,null,100114.0,"Air Base Extension",82.5,null,null,100114.0,"Air Base Extension",2099.0,null,null,100114.0,"Air Base Extension",82.5,null,null,100114.0,"Air Base Extension",100.93,null,null,100114.0,"Air Base Extension",82.5,null,null,100114.0,"Air Base Extension",82.5,null,null,"Not done","not translated yet","Not done",null,null,"Not done","not translated yet","Not done",null,"Not done","not translated yet","Not done",null,null,"Not done","not translated yet","Not done",null,null,"Not done","not translated yet","Not done",null,null,"Not done","not translated yet","Not done",null,null,"Not done","not translated yet","Not done",null,null,null,null,null,null,null,null,19.0,100114,100114,100114,100114,100114,100114,100114,100114,100114,100114,"Not done","Not done","Not done","Not done","Not done","Not done","Not done",null,null,null,null,"Air Base Extension","Air Base Extension","Air Base Extension","Extension Air Base","Air Base Extension","Air Base Extension","Air Base Extension","Air Base Extension","Air Base Extension","Air Base Extension","not translated yet","not translated yet","not translated yet","not translated yet","not translated yet","not translated yet","not translated yet",null,null,null,null,null,82.5,72.5,113,82.5,82.5,2099,82.5,100.93,82.5,82.5,"Not done","Not done","Not done","Not done","Not done","Not done","Not done"]
[100115.0,"Smart Socket Air - Typ F AT",58.25,null,null,100121.0,"Smart Socket Air - Type G (UK)",50.0,null,null,"not available in this country","not available in this country",0.0,null,null,100120.0,"Smart Socket Air - Type E (FR)",58.25,null,null,100115.0,"Smart Socket Air - Tipo F ES",58.25,null,null,100120.0,"Smart Socket Air Typ E",1499.0,null,null,100115.0,"Smart Socket Air - Typ F AT",58.25,null,null,100119.0,"Smart Socket Air - Typ J (CH, LI)",74.03,null,null,100120.0,"Smart Socket Air Typ E",58.25,null,null,100120.0,"Smart Socket Air BE Type E - NL Type F (100115)",58.25,null,null,"Not done","not translated yet","Not done",null,null,"Not done","not translated yet","Not done",null,"Not done","not translated yet","Not done",null,null,"Not done","not translated yet","Not done",null,null,"Not done","not translated yet","Not done",null,null,"Not done","not translated yet","Not done",null,null,"Not done","not translated yet","Not done",null,null,null,null,null,null,null,null,20.0,100115,100121,"not available in this country",100120,100115,100120,100115,100119,100120,100120,"Not done","Not done","Not done","Not done","Not done","Not done","Not done",null,null,null,null,"Smart Socket Air - Typ F AT","Smart Socket Air - Type G (UK)","not available in this country","Smart Socket Air - Type E (FR)","Smart Socket Air - Tipo F ES","Smart Socket Air Typ E","Smart Socket Air - Typ F AT","Smart Socket Air - Typ J (CH, LI)","Smart Socket Air Typ E","Smart Socket Air BE Type E - NL Type F (100115)","not translated yet","not translated yet","not translated yet","not translated yet","not translated yet","not translated yet","not translated yet",null,null,null,null,null,58.25,50,0,58.25,58.25,1499,58.25,74.03,58.25,58.25,"Not done","Not done","Not done","Not done","Not done","Not done","Not done"]
[100116.0,"Multi Extension Air",395.0,null,null,100116.0,"Multi Extension Air",332.5,null,null,100116.0,"Multi Extension Air",539.0,null,null,100116.0,"Multi Extension Air",395.0,null,null,100116.0,"Multi Extension Air",395.0,null,null,100116.0,"Multi Extension Air",9916.53,null,null,100116.0,"Multi Extension Air",395.0,null,null,100116.0,"Multi Extension Air",489.82,null,null,100116.0,"Multi Extension Air",395.0,null,null,100116.0,"Multi Extension Air",395.0,null,null,"Not done","not translated yet","Not done",null,null,"Not done","not translated yet","Not done",null,"Not done","not translated yet","Not done",null,null,"Not done","not translated yet","Not done",null,null,"Not done","not translated yet","Not done",null,null,"Not done","not translated yet","Not done",null,null,"Not done","not translated yet","Not done",null,null,null,null,null,null,null,null,21.0,100116,100116,100116,100116,100116,100116,100116,100116,100116,100116,"Not done","Not done","Not done","Not done","Not done","Not done","Not done",null,null,null,null,"Multi Extension Air","Multi Extension Air","Multi Extension Air","Multi Extension Air","Multi Extension Air","Multi Extension Air","Multi Extension Air","Multi Extension Air","Multi Extension Air","Multi Extension Air","not translated yet","not translated yet","not translated yet","not translated yet","not translated yet","not translated yet","not translated yet",null,null,null,null,null,395,332.5,539,395,395,9916.53,395,489.82,395,395,"Not done","Not done","Not done","Not done","Not done","Not done","Not done"]
[100117.0,"RGBW 24V Dimmer DMX",59.9,null,null,100117.0,"RGBW 24V Dimmer DMX",55.0,null,null,100117.0,"RGBW 24V Dimmer DMX",82.0,null,null,100117.0,"RGBW 24V Dimmer DMX",59.9,null,null,100117.0,"Dimmer DMX RGBW 24V",59.9,null,null,100117.0,"RGBW 24V Dimmer DMX",1499.0,null,null,100117.0,"RGBW 24V Dimmer DMX",59.9,null,null,100117.0,"RGBW 24V Dimmer DMX",74.03,null,null,100117.0,"RGBW 24V Dimmer DMX",59.9,null,null,100117.0,"RGBW 24V Dimmer DMX",59.9,null,null,"Not done","not translated yet","Not done",null,null,"Not done","not translated yet","Not done",null,"Not done","not translated yet","Not done",null,null,"Not done","not translated yet","Not done",null,null,"Not done","not translated yet","Not done",null,null,"Not done","not translated yet","Not done",null,null,"Not done","not translated yet","Not done",null,null,null,null,null,null,null,null,22.0,100117,100117,100117,100117,100117,100117,100117,100117,100117,100117,"Not done","Not done","Not done","Not done","Not done","Not done","Not done",null,null,null,null,"RGBW 24V Dimmer DMX","RGBW 24V Dimmer DMX","RGBW 24V Dimmer DMX","RGBW 24V Dimmer DMX","Dimmer DMX RGBW 24V","RGBW 24V Dimmer DMX","RGBW 24V Dimmer DMX","RGBW 24V Dimmer DMX","RGBW 24V Dimmer DMX","RGBW 24V Dimmer DMX","not translated yet","not translated yet","not translated yet","not translated yet","not translated yet","not translated yet","not translated yet",null,null,null,null,null,59.9,55,82,59.9,59.9,1499,59.9,74.03,59.9,59.9,"Not done","Not done","Not done","Not done","Not done","Not done","Not done"]
[100124.0,"Modbus Extension",190.0,null,null,100124.0,"Modbus Extension",165.0,null,null,100124.0,"Modbus Extension",255.0,null,null,100124.0,"Extension Modbus",190.0,null,null,100124.0,"Modbus Extension",190.0,null,null,100124.0,"Modbus Extension",4799.0,null,null,100124.0,"Modbus Extension",190.0,null,null,100124.0,"Modbus Extension",230.56,null,null,100124.0,"Modbus Extension",190.0,null,null,100124.0,"Modbus Extension",190.0,null,null,"Not done","not translated yet","Not done",null,null,"Not done","not translated yet","Not done",null,"Not done","not translated yet","Not done",null,null,"Not done","not translated yet","Not done",null,null,"Not done","not translated yet","Not done",null,null,"Not done","not translated yet","Not done",null,null,"Not done","not translated yet","Not done",null,null,null,null,null,null,null,null,23.0,100124,100124,100124,100124,100124,100124,100124,100124,100124,100124,"Not done","Not done","Not done","Not done","Not done","Not done","Not done",null,null,null,null,"Modbus Extension","Modbus Extension","Modbus Extension","Extension Modbus","Modbus Extension","Modbus Extension","Modbus Extension","Modbus Extension","Modbus Extension","Modbus Extension","not translated yet","not translated yet","not translated yet","not translated yet","not translated yet","not translated yet","not translated yet",null,null,null,null,null,190,165,255,190,190,4799,190,230.56,190,190,"Not done","Not done","Not done","Not done","Not done","Not done","Not done"]
[100125.0,"RGBW 24V Dimmer Air",69.9,null,null,100125.0,"RGBW 24V Dimmer Air",62.5,null,null,100125.0,"RGBW 24V Dimmer Air",96.0,null,null,100125.0,"RGBW 24V Dimmer Air",69.9,null,null,100125.0,"Dimmer Air RGBW 24V",69.9,null,null,100125.0,"RGBW 24V Dimmer Air",1849.0,null,null,100125.0,"RGBW 24V Dimmer Air",69.9,null,null,100125.0,"RGBW 24V Dimmer Air",83.29,null,null,100125.0,"RGBW 24V Dimmer Air",69.9,null,null,100125.0,"RGBW 24V Dimmer Air",69.9,null,null,"Not done","not translated yet","Not done",null,null,"Not done","not translated yet","Not done",null,"Not done","not translated yet","Not done",null,null,"Not done","not translated yet","Not done",null,null,"Not done","not translated yet","Not done",null,null,"Not done","not translated yet","Not done",null,null,"Not done","not translated yet","Not done",null,null,null,null,null,null,null,null,24.0,100125,100125,100125,100125,100125,100125,100125,100125,100125,100125,"Not done","Not done","Not done","Not done","Not done","Not done","Not done",null,null,null,null,"RGBW 24V Dimmer Air","RGBW 24V Dimmer Air","RGBW 24V Dimmer Air","RGBW 24V Dimmer Air","Dimmer Air RGBW 24V","RGBW 24V Dimmer Air","RGBW 24V Dimmer Air","RGBW 24V Dimmer Air","RGBW 24V Dimmer Air","RGBW 24V Dimmer Air","not translated yet","not translated yet","not translated yet","not translated yet","not translated yet","not translated yet","not translated yet",null,null,null,null,null,69.9,62.5,96,69.9,69.9,1849,69.9,83.29,69.9,69.9,"Not done","Not done","Not done","Not done","Not done","Not done","Not done"]
[100139.0,"Miniserver Go",299.0,null,null,100139.0,"Miniserver Go",247.5,null,null,100139.0,"Miniserver Go",349.0,null,null,100139.0,"Miniserver Go",299.0,null,null,100139.0,"Miniserver Go",299.0,null,null,100139.0,"Miniserver Go",8263.63,null,null,100139.0,"Miniserver Go",299.0,null,null,100139.0,"Miniserver Go",369.44,null,null,100139.0,"Miniserver Go",299.0,null,null,100139.0,"Miniserver Go",299.0,null,null,"Not done","not translated yet","Not done",null,null,"Not done","not translated yet","Not done",null,"Not done","not translated yet","Not done",null,null,"Not done","not translated yet","Not done",null,null,"Not done","not translated yet","Not done",null,null,"Not done","not translated yet","Not done",null,null,"Not done","not translated yet","Not done",null,null,null,null,null,null,null,null,25.0,100139,100139,100139,100139,100139,100139,100139,100139,100139,100139,"Not done","Not done","Not done","Not done","Not done","Not done","Not done",null,null,null,null,"Miniserver Go","Miniserver Go","Miniserver Go","Miniserver Go","Miniserver Go","Miniserver Go","Miniserver Go","Miniserver Go","Miniserver Go","Miniserver Go","not translated yet","not translated yet","not translated yet","not translated yet","not translated yet","not translated yet","not translated yet",null,null,null,null,null,299,247.5,349,299,299,8263.63,299,369.44,299,299,"Not done","Not done","Not done","Not done","Not done","Not done","Not done"]
[100140.0,"Remote Air",41.0,null,null,100140.0,"Remote Air",35.0,null,null,100140.0,"Remote Air",55.5,null,null,100140.0,"Remote Air",41.0,null,null,100140.0,"Remote Air",41.0,null,null,100140.0,"Remote Air",1099.0,null,null,100140.0,"Remote Air",41.0,null,null,100140.0,"Remote Air",49.95,null,null,100140.0,"Remote Air",41.0,null,null,100140.0,"Remote Air",41.0,null,null,"Not done","not translated yet","Not done",null,null,"Not done","not translated yet","Not done",null,"Not done","not translated yet","Not done",null,null,"Not done","not translated yet","Not done",null,null,"Not done","not translated yet","Not done",null,null,"Not done","not translated yet","Not done",null,null,"Not done","not translated yet","Not done",null,null,null,null,null,null,null,null,26.0,100140,100140,100140,100140,100140,100140,100140,100140,100140,100140,"Not done","Not done","Not done","Not done","Not done","Not done","Not done",null,null,null,null,"Remote Air","Remote Air","Remote Air","Remote Air","Remote Air","Remote Air","Remote Air","Remote Air","Remote Air","Remote Air","not translated yet","not translated yet","not translated yet","not translated yet","not translated yet","not translated yet","not translated yet",null,null,null,null,null,41,35,55.5,41,41,1099,41,49.95,41,41,"Not done","Not done","Not done","Not done","Not done","Not done","Not done"]
[100141.0,"IR Control Air",89.0,null,null,100141.0,"IR Control Air",77.5,null,null,100141.0,"IR Control Air",124.9,null,null,100141.0,"IR Control Air",89.0,null,null,100141.0,"IR Control Air",89.0,null,null,100141.0,"IR Control Air",2499.0,null,null,100141.0,"IR Control Air",89.0,null,null,100141.0,"IR Control Air",110.19,null,null,100141.0,"IR Control Air",89.0,null,null,100141.0,"IR Control Air",89.0,null,null,"Not done","not translated yet","Not done",null,null,"Not done","not translated yet","Not done",null,"Not done","not translated yet","Not done",null,null,"Not done","not translated yet","Not done",null,null,"Not done","not translated yet","Not done",null,null,"Not done","not translated yet","Not done",null,null,"Not done","not translated yet","Not done",null,null,null,null,null,null,null,null,27.0,100141,100141,100141,100141,100141,100141,100141,100141,100141,100141,"Not done","Not done","Not done","Not done","Not done","Not done","Not done",null,null,null,null,"IR Control Air","IR Control Air","IR Control Air","IR Control Air","IR Control Air","IR Control Air","IR Control Air","IR Control Air","IR Control Air","IR Control Air","not translated yet","not translated yet","not translated yet","not translated yet","not translated yet","not translated yet","not translated yet",null,null,null,null,null,89,77.5,124.9,89,89,2499,89,110.19,89,89,"Not done","Not done","Not done","Not done","Not done","Not done","Not done"]
[100142.0,"Smoke Detector Air",75.0,null,null,100142.0,"Smoke Detector Air",65.0,null,null,100142.0,"Smoke Detector Air",99.0,null,null,100142.0,"Détecteur de Fumée Air",75.0,null,null,100142.0,"Detector de humo Air",75.0,null,null,100142.0,"Detektor kouře Air",2049.0,null,null,100142.0,"Smoke Detector Air",75.0,null,null,100142.0,"Smoke Detector Air",89.77,null,null,100142.0,"Detektor kouře Air",75.0,null,null,100142.0,"Smoke Detector Air",75.0,null,null,"Not done","not translated yet","Not done",null,null,"Not done","not translated yet","Not done",null,"Not done","not translated yet","Not done",null,null,"Not done","not translated yet","Not done",null,null,"Not done","not translated yet","Not done",null,null,"Not done","not translated yet","Not done",null,null,"Not done","not translated yet","Not done",null,null,null,null,null,null,null,null,28.0,100142,100142,100142,100142,100142,100142,100142,100142,100142,100142,"Not done","Not done","Not done","Not done","Not done","Not done","Not done",null,null,null,null,"Smoke Detector Air","Smoke Detector Air","Smoke Detector Air","Détecteur de Fumée Air","Detector de humo Air","Detektor kouře Air","Smoke Detector Air","Smoke Detector Air","Detektor kouře Air","Smoke Detector Air","not translated yet","not translated yet","not translated yet","not translated yet","not translated yet","not translated yet","not translated yet",null,null,null,null,null,75,65,99,75,75,2049,75,89.77,75,75,"Not done","Not done","Not done","Not done","Not done","Not done","Not done"]
[100149.0,"Temperatur & Feuchtefühler Air",69.0,null,null,100149.0,"Temperature & Humidity Sesnor Air",57.5,null,null,100149.0,"Temperature & Humidity Sesnor Air",79.0,null,null,100149.0,"Sonde de Température et humidité Air",69.0,null,null,100149.0,"Sensor de temperatura y humedad Air",69.0,null,null,100149.0,"Senzor teploty & vlhkosti Air",1899.0,null,null,100149.0,"Sensore temperatura & umidità Air",69.0,null,null,100149.0,"Temperatur & Feuchtefühler Air",86.99,null,null,100149.0,"Senzor teploty & vlhkosti Air",69.0,null,null,100149.0,"Temperatuur & Vochtigheidsvoeler Air",69.0,null,null,"Not done","not translated yet","Not done",null,null,"Not done","not translated yet","Not done",null,"Not done","not translated yet","Not done",null,null,"Not done","not translated yet","Not done",null,null,"Not done","not translated yet","Not done",null,null,"Not done","not translated yet","Not done",null,null,"Not done","not translated yet","Not done",null,null,null,null,null,null,null,null,29.0,100149,100149,100149,100149,100149,100149,100149,100149,100149,100149,"Not done","Not done","Not done","Not done","Not done","Not done","Not done",null,null,null,null,"Temperatur & Feuchtefühler Air","Temperature & Humidity Sesnor Air","Temperature & Humidity Sesnor Air","Sonde de Température et humidité Air","Sensor de temperatura y humedad Air","Senzor teploty & vlhkosti Air","Sensore temperatura & umidità Air","Temperatur & Feuchtefühler Air","Senzor teploty & vlhkosti Air","Temperatuur & Vochtigheidsvoeler Air","not translated yet","not translated yet","not translated yet","not translated yet","not translated yet","not translated yet","not translated yet",null,null,null,null,null,69,57.5,79,69,69,1899,69,86.99,69,69,"Not done","Not done","Not done","Not done","Not done","Not done","Not done"]
[100150.0,"Werkzeug-Set by Weidmüller",305.0,null,null,100150.0,"Loxone Tool Kit by Weidmüller",257.5,null,null,100150.0,"Loxone Tool Kit by Weidmüller",339.0,null,null,100150.0,"Loxone Tool Kit by Weidmüller",305.0,null,null,100150.0,"Estuche de herramientas by Weidmüller",305.0,null,null,100150.0,"Loxone set nářadí",8399.0,null,null,100150.0,"Set atrezzi by Weidmüller",305.0,null,null,100150.0,"Werkzeug-Set by Weidmüller",397.22,null,null,100150.0,"Loxone set nářadí",305.0,null,null,100150.0,"Loxone Tool Kit van Weidmüller",305.0,null,null,"Not done","not translated yet","Not done",null,null,"Not done","not translated yet","Not done",null,"Not done","not translated yet","Not done",null,null,"Not done","not translated yet","Not done",null,null,"Not done","not translated yet","Not done",null,null,"Not done","not translated yet","Not done",null,null,"Not done","not translated yet","Not done",null,null,null,null,null,null,null,null,30.0,100150,100150,100150,100150,100150,100150,100150,100150,100150,100150,"Not done","Not done","Not done","Not done","Not done","Not done","Not done",null,null,null,null,"Werkzeug-Set by Weidmüller","Loxone Tool Kit by Weidmüller","Loxone Tool Kit by Weidmüller","Loxone Tool Kit by Weidmüller","Estuche de herramientas by Weidmüller","Loxone set nářadí","Set atrezzi by Weidmüller","Werkzeug-Set by Weidmüller","Loxone set nářadí","Loxone Tool Kit van Weidmüller","not translated yet","not translated yet","not translated yet","not translated yet","not translated yet","not translated yet","not translated yet",null,null,null,null,null,305,257.5,339,305,305,8399,305,397.22,305,305,"Not done","Not done","Not done","Not done","Not done","Not done","Not done"]
[100151.0,"Loxone Zählerinterface IR Air",89.0,null,null,100151.0,"Loxone Meter Reader IR Air",77.5,null,null,"not available in this country","not available in this country",0.0,null,null,100151.0,"Controleur IR Air",89.0,null,null,100151.0,"Contador IR Air Loxone",89.0,null,null,100151.0,"IR Elektroměr Air",2099.0,null,null,100151.0,"Loxone contatore interface IR Air",89.0,null,null,100151.0,"Loxone Zählerinterface IR Air",119.44,null,null,"not available in this country","not available in this country",0.0,null,null,100151.0,"Loxone Tellerinterface IR AIR",89.0,null,null,"Not done","not translated yet","Not done",null,null,"Not done","not translated yet","Not done",null,"Not done","not translated yet","Not done",null,null,"Not done","not translated yet","Not done",null,null,"Not done","not translated yet","Not done",null,null,"Not done","not translated yet","Not done",null,null,"Not done","not translated yet","Not done",null,null,null,null,null,null,null,null,31.0,100151,100151,"not available in this country",100151,100151,100151,100151,100151,"not available in this country",100151,"Not done","Not done","Not done","Not done","Not done","Not done","Not done",null,null,null,null,"Loxone Zählerinterface IR Air","Loxone Meter Reader IR Air","not available in this country","Controleur IR Air","Contador IR Air Loxone","IR Elektroměr Air","Loxone contatore interface IR Air","Loxone Zählerinterface IR Air","not available in this country","Loxone Tellerinterface IR AIR","not translated yet","not translated yet","not translated yet","not translated yet","not translated yet","not translated yet","not translated yet",null,null,null,null,null,89,77.5,0,89,89,2099,89,119.44,0,89,"Not done","Not done","Not done","Not done","Not done","Not done","Not done"]
[100153.0,"Nano IO Air",92.0,null,null,100153.0,"Nano IO Air",75.0,null,null,100153.0,"Nano IO Air",119.0,null,null,100153.0,"Nano IO Air",92.0,null,null,100153.0,"Nano IO Air",92.0,null,null,100153.0,"Nano IO Air",2499.0,null,null,100153.0,"Nano IO Air",92.0,null,null,100153.0,"Nano IO Air",110.19,null,null,100153.0,"Nano IO Air",92.0,null,null,100153.0,"Nano IO Air",92.0,null,null,"Not done","not translated yet","Not done",null,null,"Not done","not translated yet","Not done",null,"Not done","not translated yet","Not done",null,null,"Not done","not translated yet","Not done",null,null,"Not done","not translated yet","Not done",null,null,"Not done","not translated yet","Not done",null,null,"Not done","not translated yet","Not done",null,null,null,null,null,null,null,null,32.0,100153,100153,100153,100153,100153,100153,100153,100153,100153,100153,"Not done","Not done","Not done","Not done","Not done","Not done","Not done",null,null,null,null,"Nano IO Air","Nano IO Air","Nano IO Air","Nano IO Air","Nano IO Air","Nano IO Air","Nano IO Air","Nano IO Air","Nano IO Air","Nano IO Air","not translated yet","not translated yet","not translated yet","not translated yet","not translated yet","not translated yet","not translated yet",null,null,null,null,null,92,75,119,92,92,2499,92,110.19,92,92,"Not done","Not done","Not done","Not done","Not done","Not done","Not done"]
[100154.0,"Loxone Touch for Nano Weiß",39.0,null,null,100154.0,"Loxone Touch for Nano White",30.0,null,null,100154.0,"Loxone Touch for Nano White",49.0,null,null,100154.0,"Loxone Touch pour Nano Blanc",39.0,null,null,100154.0,"Loxone Touch para Nano blanco",39.0,null,null,100154.0,"Loxone Touch for Nano Bílá",1049.0,null,null,100154.0,"Loxone Touch for Nano bianco",39.0,null,null,100154.0,"Loxone Touch for Nano Weiß",49.03,null,null,100154.0,"Loxone Touch for Nano Bílá",39.0,null,null,100154.0,"Loxone Touch for Nano Wit",39.0,null,null,"Not done","not translated yet","Not done",null,null,"Not done","not translated yet","Not done",null,"Not done","not translated yet","Not done",null,null,"Not done","not translated yet","Not done",null,null,"Not done","not translated yet","Not done",null,null,"Not done","not translated yet","Not done",null,null,"Not done","not translated yet","Not done",null,null,null,null,null,null,null,null,33.0,100154,100154,100154,100154,100154,100154,100154,100154,100154,100154,"Not done","Not done","Not done","Not done","Not done","Not done","Not done",null,null,null,null,"Loxone Touch for Nano Weiß","Loxone Touch for Nano White","Loxone Touch for Nano White","Loxone Touch pour Nano Blanc","Loxone Touch para Nano blanco","Loxone Touch for Nano Bílá","Loxone Touch for Nano bianco","Loxone Touch for Nano Weiß","Loxone Touch for Nano Bílá","Loxone Touch for Nano Wit","not translated yet","not translated yet","not translated yet","not translated yet","not translated yet","not translated yet","not translated yet",null,null,null,null,null,39,30,49,39,39,1049,39,49.03,39,39,"Not done","Not done","Not done","Not done","Not done","Not done","Not done"]
[100155.0,"Loxone Touch Air Weiß",89.0,null,null,100155.0,"Loxone Touch Air White",72.5,null,null,100155.0,"Loxone Touch Air White",124.0,null,null,100155.0,"Loxone Touch Air Blanc",89.0,null,null,100155.0,"Loxone Touch Air blanco",89.0,null,null,100155.0,"Loxone Touch Air Bílá",2499.0,null,null,100155.0,"Loxone Touch Air bianco",89.0,null,null,100155.0,"Loxone Touch Air Weiß",110.19,null,null,100155.0,"Loxone Touch Air Bílá",89.0,null,null,100155.0,"Loxone Touch Air Wit",89.0,null,null,"Not done","not translated yet","Not done",null,null,"Not done","not translated yet","Not done",null,"Not done","not translated yet","Not done",null,null,"Not done","not translated yet","Not done",null,null,"Not done","not translated yet","Not done",null,null,"Not done","not translated yet","Not done",null,null,"Not done","not translated yet","Not done",null,null,null,null,null,null,null,null,34.0,100155,100155,100155,100155,100155,100155,100155,100155,100155,100155,"Not done","Not done","Not done","Not done","Not done","Not done","Not done",null,null,null,null,"Loxone Touch Air Weiß","Loxone Touch Air White","Loxone Touch Air White","Loxone Touch Air Blanc","Loxone Touch Air blanco","Loxone Touch Air Bílá","Loxone Touch Air bianco","Loxone Touch Air Weiß","Loxone Touch Air Bílá","Loxone Touch Air Wit","not translated yet","not translated yet","not translated yet","not translated yet","not translated yet","not translated yet","not translated yet",null,null,null,null,null,89,72.5,124,89,89,2499,89,110.19,89,89,"Not done","Not done","Not done","Not done","Not done","Not done","Not done"]
[100158.0,"Fröling Extension",165.83,null,null,100158.0,"Fröling Extension",147.5,null,null,"not available in this country","not available in this country",0.0,null,null,100158.0,"Extension Fröling",165.83,null,null,100158.0,"Fröling Extension",165.83,null,null,100158.0,"Fröling Extension",4499.0,null,null,100158.0,"Fröling Extension",165.83,null,null,100158.0,"Fröling Extension",202.78,null,null,100158.0,"Fröling Extension",165.83,null,null,100158.0,"Fröling Extension",165.83,null,null,"Not done","not translated yet","Not done",null,null,"Not done","not translated yet","Not done",null,"Not done","not translated yet","Not done",null,null,"Not done","not translated yet","Not done",null,null,"Not done","not translated yet","Not done",null,null,"Not done","not translated yet","Not done",null,null,"Not done","not translated yet","Not done",null,null,null,null,null,null,null,null,35.0,100158,100158,"not available in this country",100158,100158,100158,100158,100158,100158,100158,"Not done","Not done","Not done","Not done","Not done","Not done","Not done",null,null,null,null,"Fröling Extension","Fröling Extension","not available in this country","Extension Fröling","Fröling Extension","Fröling Extension","Fröling Extension","Fröling Extension","Fröling Extension","Fröling Extension","not translated yet","not translated yet","not translated yet","not translated yet","not translated yet","not translated yet","not translated yet",null,null,null,null,null,165.83,147.5,0,165.83,165.83,4499,165.83,202.78,165.83,165.83,"Not done","Not done","Not done","Not done","Not done","Not done","Not done"]
[100163.0,"Stellantrieb Air",78.0,null,null,100163.0,"Valve Actuator Air",60.0,null,null,100163.0,"Valve Actuator Air",86.0,null,null,100163.0,"Tête Thermostatique Air",78.0,null,null,100163.0,"Actuador válvula Air",78.0,null,null,100163.0,"Hlavice Air",2099.0,null,null,100163.0,"Valvola termica Air",78.0,null,null,100163.0,"Stellantrieb Air",100.93,null,null,100163.0,"Hlavice Air",78.0,null,null,100163.0,"Stelventiel Air",78.0,null,null,"Not done","not translated yet","Not done",null,null,"Not done","not translated yet","Not done",null,"Not done","not translated yet","Not done",null,null,"Not done","not translated yet","Not done",null,null,"Not done","not translated yet","Not done",null,null,"Not done","not translated yet","Not done",null,null,"Not done","not translated yet","Not done",null,null,null,null,null,null,null,null,36.0,100163,100163,100163,100163,100163,100163,100163,100163,100163,100163,"Not done","Not done","Not done","Not done","Not done","Not done","Not done",null,null,null,null,"Stellantrieb Air","Valve Actuator Air","Valve Actuator Air","Tête Thermostatique Air","Actuador válvula Air","Hlavice Air","Valvola termica Air","Stellantrieb Air","Hlavice Air","Stelventiel Air","not translated yet","not translated yet","not translated yet","not translated yet","not translated yet","not translated yet","not translated yet",null,null,null,null,null,78,60,86,78,78,2099,78,100.93,78,78,"Not done","Not done","Not done","Not done","Not done","Not done","Not done"]
[100165.0,"Loxone Music Server 4",1150.0,null,null,100165.0,"Loxone Music Server 4 Zone",982.5,null,null,100165.0,"Loxone Music Server 4 Zone",1249.0,null,null,100165.0,"Loxone Music Server 4 Zones",1150.0,null,null,100165.0,"Loxone Music Server 4 zonas",1150.0,null,null,100165.0,"Loxone Music Server 4 Zóny",31999.0,null,null,100165.0,"Loxone Music Server 4",1150.0,null,null,100165.0,"Loxone Music Server 4",1443.52,null,null,100165.0,"Loxone Music Server 4 Zóny",1150.0,null,null,100165.0,"Loxone Music Server 4 Zones",1150.0,null,null,"Not done","not translated yet","Not done",null,null,"Not done","not translated yet","Not done",null,"Not done","not translated yet","Not done",null,null,"Not done","not translated yet","Not done",null,null,"Not done","not translated yet","Not done",null,null,"Not done","not translated yet","Not done",null,null,"Not done","not translated yet","Not done",null,null,null,null,null,null,null,null,37.0,100165,100165,100165,100165,100165,100165,100165,100165,100165,100165,"Not done","Not done","Not done","Not done","Not done","Not done","Not done",null,null,null,null,"Loxone Music Server 4","Loxone Music Server 4 Zone","Loxone Music Server 4 Zone","Loxone Music Server 4 Zones","Loxone Music Server 4 zonas","Loxone Music Server 4 Zóny","Loxone Music Server 4","Loxone Music Server 4","Loxone Music Server 4 Zóny","Loxone Music Server 4 Zones","not translated yet","not translated yet","not translated yet","not translated yet","not translated yet","not translated yet","not translated yet",null,null,null,null,null,1150,982.5,1249,1150,1150,31999,1150,1443.52,1150,1150,"Not done","Not done","Not done","Not done","Not done","Not done","Not done"]
[100166.0,"Loxone Music Server 8",1699.0,null,null,100166.0,"Loxone Music Server 8 Zone",1457.5,null,null,100166.0,"Loxone Music Server 8 Zone",1849.0,null,null,100166.0,"Loxone Music Server 8 Zones",1699.0,null,null,100166.0,"Loxone Music Server 8 zonas",1699.0,null,null,100166.0,"Loxone Music Server 8 Zón",44999.0,null,null,100166.0,"Loxone Music Server 8",1699.0,null,null,100166.0,"Loxone Music Server 8",2128.7,null,null,100166.0,"Loxone Music Server 8 Zón",1699.0,null,null,100166.0,"Loxone Music Server 8 Zones",1699.0,null,null,"Not done","not translated yet","Not done",null,null,"Not done","not translated yet","Not done",null,"Not done","not translated yet","Not done",null,null,"Not done","not translated yet","Not done",null,null,"Not done","not translated yet","Not done",null,null,"Not done","not translated yet","Not done",null,null,"Not done","not translated yet","Not done",null,null,null,null,null,null,null,null,38.0,100166,100166,100166,100166,100166,100166,100166,100166,100166,100166,"Not done","Not done","Not done","Not done","Not done","Not done","Not done",null,null,null,null,"Loxone Music Server 8","Loxone Music Server 8 Zone","Loxone Music Server 8 Zone","Loxone Music Server 8 Zones","Loxone Music Server 8 zonas","Loxone Music Server 8 Zón","Loxone Music Server 8","Loxone Music Server 8","Loxone Music Server 8 Zón","Loxone Music Server 8 Zones","not translated yet","not translated yet","not translated yet","not translated yet","not translated yet","not translated yet","not translated yet",null,null,null,null,null,1699,1457.5,1849,1699,1699,44999,1699,2128.7,1699,1699,"Not done","Not done","Not done","Not done","Not done","Not done","Not done"]
[100167.0,"Loxone Music Server 12",1999.0,null,null,100167.0,"Loxone Music Server 12 Zone",1707.5,null,null,100167.0,"Loxone Music Server 12 Zone",2099.0,null,null,100167.0,"Loxone Music Server 12 Zones",1999.0,null,null,100167.0,"Loxone Music Server 12 zonas",1999.0,null,null,100167.0,"Loxone Music Server 12 Zón",52499.0,null,null,100167.0,"Loxone Music Server 12",1999.0,null,null,100167.0,"Loxone Music Server 12",2499.07,null,null,100167.0,"Loxone Music Server 12 Zón",1999.0,null,null,100167.0,"Loxone Music Server 12 Zones",1999.0,null,null,"Not done","not translated yet","Not done",null,null,"Not done","not translated yet","Not done",null,"Not done","not translated yet","Not done",null,null,"Not done","not translated yet","Not done",null,null,"Not done","not translated yet","Not done",null,null,"Not done","not translated yet","Not done",null,null,"Not done","not translated yet","Not done",null,null,null,null,null,null,null,null,39.0,100167,100167,100167,100167,100167,100167,100167,100167,100167,100167,"Not done","Not done","Not done","Not done","Not done","Not done","Not done",null,null,null,null,"Loxone Music Server 12","Loxone Music Server 12 Zone","Loxone Music Server 12 Zone","Loxone Music Server 12 Zones","Loxone Music Server 12 zonas","Loxone Music Server 12 Zón","Loxone Music Server 12","Loxone Music Server 12","Loxone Music Server 12 Zón","Loxone Music Server 12 Zones","not translated yet","not translated yet","not translated yet","not translated yet","not translated yet","not translated yet","not translated yet",null,null,null,null,null,1999,1707.5,2099,1999,1999,52499,1999,2499.07,1999,1999,"Not done","Not done","Not done","Not done","Not done","Not done","Not done"]
[100168.0,"Loxone Music Server 16",2499.0,null,null,100168.0,"Loxone Music Server 16 Zone",2132.5,null,null,100168.0,"Loxone Music Server 16 Zone",2649.0,null,null,100168.0,"Loxone Music Server 16 Zones",2499.0,null,null,100168.0,"Loxone Music Server 16 zonas",2499.0,null,null,100168.0,"Loxone Music Server 16 Zón",64999.0,null,null,100168.0,"Loxone Music Server 16",2499.0,null,null,100168.0,"Loxone Music Server 16",3147.22,null,null,100168.0,"Loxone Music Server 16 Zón",2499.0,null,null,100168.0,"Loxone Music Server 16 Zones",2499.0,null,null,"Not done","not translated yet","Not done",null,null,"Not done","not translated yet","Not done",null,"Not done","not translated yet","Not done",null,null,"Not done","not translated yet","Not done",null,null,"Not done","not translated yet","Not done",null,null,"Not done","not translated yet","Not done",null,null,"Not done","not translated yet","Not done",null,null,null,null,null,null,null,null,40.0,100168,100168,100168,100168,100168,100168,100168,100168,100168,100168,"Not done","Not done","Not done","Not done","Not done","Not done","Not done",null,null,null,null,"Loxone Music Server 16","Loxone Music Server 16 Zone","Loxone Music Server 16 Zone","Loxone Music Server 16 Zones","Loxone Music Server 16 zonas","Loxone Music Server 16 Zón","Loxone Music Server 16","Loxone Music Server 16","Loxone Music Server 16 Zón","Loxone Music Server 16 Zones","not translated yet","not translated yet","not translated yet","not translated yet","not translated yet","not translated yet","not translated yet",null,null,null,null,null,2499,2132.5,2649,2499,2499,64999,2499,3147.22,2499,2499,"Not done","Not done","Not done","Not done","Not done","Not done","Not done"]
[100169.0,"Loxone Music Server 20",2799.0,null,null,100169.0,"Loxone Music Server 20 Zone",2382.5,null,null,100169.0,"Loxone Music Server 20 Zone",2999.0,null,null,100169.0,"Loxone Music Server 20 Zones",2799.0,null,null,100169.0,"Loxone Music Server 20 zonas",2799.0,null,null,100169.0,"Loxone Music Server 20 Zón",74999.0,null,null,100169.0,"Loxone Music Server 20",2799.0,null,null,100169.0,"Loxone Music Server 20",3517.59,null,null,100169.0,"Loxone Music Server 20 Zón",2799.0,null,null,100169.0,"Loxone Music Server 20 Zones",2799.0,null,null,"Not done","not translated yet","Not done",null,null,"Not done","not translated yet","Not done",null,"Not done","not translated yet","Not done",null,null,"Not done","not translated yet","Not done",null,null,"Not done","not translated yet","Not done",null,null,"Not done","not translated yet","Not done",null,null,"Not done","not translated yet","Not done",null,null,null,null,null,null,null,null,41.0,100169,100169,100169,100169,100169,100169,100169,100169,100169,100169,"Not done","Not done","Not done","Not done","Not done","Not done","Not done",null,null,null,null,"Loxone Music Server 20","Loxone Music Server 20 Zone","Loxone Music Server 20 Zone","Loxone Music Server 20 Zones","Loxone Music Server 20 zonas","Loxone Music Server 20 Zón","Loxone Music Server 20","Loxone Music Server 20","Loxone Music Server 20 Zón","Loxone Music Server 20 Zones","not translated yet","not translated yet","not translated yet","not translated yet","not translated yet","not translated yet","not translated yet",null,null,null,null,null,2799,2382.5,2999,2799,2799,74999,2799,3517.59,2799,2799,"Not done","Not done","Not done","Not done","Not done","Not done","Not done"]
[100170.0,"Loxone Tischaufsteller",39.0,null,null,"NA","not available in this country",0.0,null,null,"not available in this country","not available in this country",0.0,null,null,"not available in this country","not available in this country",null,null,null,"not available in this country","not available in this country",0.0,"NO AVAIABLE IN LOXONE SHOP ES",null,"not available in this country","not available in this country",0.0,null,null,100170.0,"Loxone espositore da tavolo",39.0,null,null,100170.0,"Loxone Tischaufsteller",50.88,null,null,"not available in this country","not available in this country",0.0,null,null,100170.0,"Loxone tafeldisplay",39.0,null,null,"Not done","not translated yet","Not done",null,null,"Not done","not translated yet","Not done",null,"Not done","not translated yet","Not done",null,null,"Not done","not translated yet","Not done",null,null,"Not done","not translated yet","Not done",null,null,"Not done","not translated yet","Not done",null,null,"Not done","not translated yet","Not done",null,null,null,null,null,null,null,null,42.0,100170,"NA","not available in this country","not available in this country","not available in this country","not available in this country",100170,100170,"not available in this country",100170,"Not done","Not done","Not done","Not done","Not done","Not done","Not done",null,null,null,null,"Loxone Tischaufsteller","not available in this country","not available in this country","not available in this country","not available in this country","not available in this country","Loxone espositore da tavolo","Loxone Tischaufsteller","not available in this country","Loxone tafeldisplay","not translated yet","not translated yet","not translated yet","not translated yet","not translated yet","not translated yet","not translated yet",null,null,null,null,null,39,0,0,"",0,0,39,50.88,0,39,"Not done","Not done","Not done","Not done","Not done","Not done","Not done"]
[100178.0,"AquaStar Air 1,5\"",1400.0,null,null,100178.0,"AquaStar Air 1.5\"",1187.5,null,null,100178.0,"AquaStar Air 1.5\"",1549.0,null,null,100178.0,"AquaStar Air 1.5\"",1400.0,null,null,100178.0,"AquaStar Air 1,5\"",1400.0,null,null,100178.0,"AquaStar Air 1.5\"",38999.0,null,null,100178.0,"AquaStar Air 1,5\"",1400.0,null,null,100178.0,"AquaStar Air 1,5\"",1823.14,null,null,100178.0,"AquaStar Air 1.5\"",1400.0,null,null,100178.0,"AquaStar Air 1.5\"",1400.0,null,null,"Not done","not translated yet","Not done",null,null,"Not done","not translated yet","Not done",null,"Not done","not translated yet","Not done",null,null,"Not done","not translated yet","Not done",null,null,"Not done","not translated yet","Not done",null,null,"Not done","not translated yet","Not done",null,null,"Not done","not translated yet","Not done",null,null,null,null,null,null,null,null,43.0,100178,100178,100178,100178,100178,100178,100178,100178,100178,100178,"Not done","Not done","Not done","Not done","Not done","Not done","Not done",null,null,null,null,"AquaStar Air 1,5\"","AquaStar Air 1.5\"","AquaStar Air 1.5\"","AquaStar Air 1.5\"","AquaStar Air 1,5\"","AquaStar Air 1.5\"","AquaStar Air 1,5\"","AquaStar Air 1,5\"","AquaStar Air 1.5\"","AquaStar Air 1.5\"","not translated yet","not translated yet","not translated yet","not translated yet","not translated yet","not translated yet","not translated yet",null,null,null,null,null,1400,1187.5,1549,1400,1400,38999,1400,1823.14,1400,1400,"Not done","Not done","Not done","Not done","Not done","Not done","Not done"]
[100179.0,"AquaStar Air 2\"",1500.0,null,null,100179.0,"AquaStar Air 2\"",1272.5,null,null,100179.0,"AquaStar Air 2\"",1649.0,null,null,100179.0,"AquaStar Air 2\"",1500.0,null,null,100179.0,"AquaStar Air 2\"",1500.0,null,null,100179.0,"AquaStar Air 2\"",51999.0,null,null,100179.0,"AquaStar Air 2\"",1500.0,null,null,100179.0,"AquaStar Air 2\"",1943.51,null,null,100179.0,"AquaStar Air 2\"",1500.0,null,null,100179.0,"AquaStar Air 2\"",1500.0,null,null,"Not done","not translated yet","Not done",null,null,"Not done","not translated yet","Not done",null,"Not done","not translated yet","Not done",null,null,"Not done","not translated yet","Not done",null,null,"Not done","not translated yet","Not done",null,null,"Not done","not translated yet","Not done",null,null,"Not done","not translated yet","Not done",null,null,null,null,null,null,null,null,44.0,100179,100179,100179,100179,100179,100179,100179,100179,100179,100179,"Not done","Not done","Not done","Not done","Not done","Not done","Not done",null,null,null,null,"AquaStar Air 2\"","AquaStar Air 2\"","AquaStar Air 2\"","AquaStar Air 2\"","AquaStar Air 2\"","AquaStar Air 2\"","AquaStar Air 2\"","AquaStar Air 2\"","AquaStar Air 2\"","AquaStar Air 2\"","not translated yet","not translated yet","not translated yet","not translated yet","not translated yet","not translated yet","not translated yet",null,null,null,null,null,1500,1272.5,1649,1500,1500,51999,1500,1943.51,1500,1500,"Not done","Not done","Not done","Not done","Not done","Not done","Not done"]
[100180.0,"Loxone Touch Air Anthrazit",89.0,null,null,100180.0,"Loxone Touch Air Anthracite",72.5,null,null,100180.0,"Loxone Touch Air Anthracite",124.0,null,null,100180.0,"Loxone Touch Air Anthracite",89.0,null,null,100180.0,"Loxone Touch Air Antracita",89.0,null,null,100180.0,"Loxone Touch Air Anthrazit",2499.0,null,null,100180.0,"Loxone Touch Air antracite",89.0,null,null,100180.0,"Loxone Touch Air Anthrazit",110.19,null,null,100180.0,"Loxone Touch Air Anthrazit",89.0,null,null,100180.0,"Loxone Touch Air Anthraciet",89.0,null,null,"Not done","not translated yet","Not done",null,null,"Not done","not translated yet","Not done",null,"Not done","not translated yet","Not done",null,null,"Not done","not translated yet","Not done",null,null,"Not done","not translated yet","Not done",null,null,"Not done","not translated yet","Not done",null,null,"Not done","not translated yet","Not done",null,null,null,null,null,null,null,null,45.0,100180,100180,100180,100180,100180,100180,100180,100180,100180,100180,"Not done","Not done","Not done","Not done","Not done","Not done","Not done",null,null,null,null,"Loxone Touch Air Anthrazit","Loxone Touch Air Anthracite","Loxone Touch Air Anthracite","Loxone Touch Air Anthracite","Loxone Touch Air Antracita","Loxone Touch Air Anthrazit","Loxone Touch Air antracite","Loxone Touch Air Anthrazit","Loxone Touch Air Anthrazit","Loxone Touch Air Anthraciet","not translated yet","not translated yet","not translated yet","not translated yet","not translated yet","not translated yet","not translated yet",null,null,null,null,null,89,72.5,124,89,89,2499,89,110.19,89,89,"Not done","Not done","Not done","Not done","Not done","Not done","Not done"]
[100181.0,"Loxone Touch for Nano Anthrazit",39.0,null,null,100181.0,"Loxone Touch for Nano Anthracite",30.0,null,null,100181.0,"Loxone Touch for Nano Anthracite",49.0,null,null,100181.0,"Loxone Touch pour Nano Anthracite",39.0,null,null,100181.0,"Loxone Touch para Nano Antracita",39.0,null,null,100181.0,"Loxone Touch for Nano Anthrazit",1049.0,null,null,100181.0,"Loxone Touch for Nano antracite",39.0,null,null,100181.0,"Loxone Touch for Nano Anthrazit",49.03,null,null,100181.0,"Loxone Touch for Nano Anthrazit",39.0,null,null,100181.0,"Loxone Touch for Nano Anthraciet",39.0,null,null,"Not done","not translated yet","Not done",null,null,"Not done","not translated yet","Not done",null,"Not done","not translated yet","Not done",null,null,"Not done","not translated yet","Not done",null,null,"Not done","not translated yet","Not done",null,null,"Not done","not translated yet","Not done",null,null,"Not done","not translated yet","Not done",null,null,null,null,null,null,null,null,46.0,100181,100181,100181,100181,100181,100181,100181,100181,100181,100181,"Not done","Not done","Not done","Not done","Not done","Not done","Not done",null,null,null,null,"Loxone Touch for Nano Anthrazit","Loxone Touch for Nano Anthracite","Loxone Touch for Nano Anthracite","Loxone Touch pour Nano Anthracite","Loxone Touch para Nano Antracita","Loxone Touch for Nano Anthrazit","Loxone Touch for Nano antracite","Loxone Touch for Nano Anthrazit","Loxone Touch for Nano Anthrazit","Loxone Touch for Nano Anthraciet","not translated yet","not translated yet","not translated yet","not translated yet","not translated yet","not translated yet","not translated yet",null,null,null,null,null,39,30,49,39,39,1049,39,49.03,39,39,"Not done","Not done","Not done","Not done","Not done","Not done","Not done"]
[100182.0,"Geiger SOLIDline Air 10Nm",165.0,null,null,100182.0,"Tubular Motor SOLIDline Air 10Nm",130.0,null,null,"not available in this country","not available in this country",0.0,null,null,100182.0,"Moteur SOLIDline Air 10Nm",165.0,null,null,100182.0,"Motor persiana SOLIDline Air 10Nm",165.0,null,null,100182.0,"Trubkový Motor SOLIDline Air 10Nm",4499.0,null,null,100182.0,"Geiger SOLIDline Air 10Nm",165.0,null,null,100182.0,"Geiger SOLIDline Air 10Nm",202.78,null,null,100182.0,"Trubkový Motor SOLIDline Air 10Nm",165.0,null,null,100182.0,"Tubular Motor SOLIDline Air 10Nm",165.0,null,null,"Not done","not translated yet","Not done",null,null,"Not done","not translated yet","Not done",null,"Not done","not translated yet","Not done",null,null,"Not done","not translated yet","Not done",null,null,"Not done","not translated yet","Not done",null,null,"Not done","not translated yet","Not done",null,null,"Not done","not translated yet","Not done",null,null,null,null,null,null,null,null,47.0,100182,100182,"not available in this country",100182,100182,100182,100182,100182,100182,100182,"Not done","Not done","Not done","Not done","Not done","Not done","Not done",null,null,null,null,"Geiger SOLIDline Air 10Nm","Tubular Motor SOLIDline Air 10Nm","not available in this country","Moteur SOLIDline Air 10Nm","Motor persiana SOLIDline Air 10Nm","Trubkový Motor SOLIDline Air 10Nm","Geiger SOLIDline Air 10Nm","Geiger SOLIDline Air 10Nm","Trubkový Motor SOLIDline Air 10Nm","Tubular Motor SOLIDline Air 10Nm","not translated yet","not translated yet","not translated yet","not translated yet","not translated yet","not translated yet","not translated yet",null,null,null,null,null,165,130,0,165,165,4499,165,202.78,165,165,"Not done","Not done","Not done","Not done","Not done","Not done","Not done"]
[100183.0,"Geiger SOLIDline Air 20Nm",185.0,null,null,100183.0,"Tubular Motor SOLIDline Air 20Nm",145.0,null,null,"not available in this country","not available in this country",0.0,null,null,100183.0,"Moteurr SOLIDline Air 20Nm",185.0,null,null,100183.0,"Motor persiana SOLIDline Air 20Nm",185.0,null,null,100183.0,"Trubkový Motor SOLIDline Air 20Nm",4999.0,null,null,100183.0,"Geiger SOLIDline Air 20Nm",185.0,null,null,100183.0,"Geiger SOLIDline Air 20Nm",230.56,null,null,100183.0,"Trubkový Motor SOLIDline Air 20Nm",185.0,null,null,100183.0,"Tubular Motor SOLIDline Air 20Nm",185.0,null,null,"Not done","not translated yet","Not done",null,null,"Not done","not translated yet","Not done",null,"Not done","not translated yet","Not done",null,null,"Not done","not translated yet","Not done",null,null,"Not done","not translated yet","Not done",null,null,"Not done","not translated yet","Not done",null,null,"Not done","not translated yet","Not done",null,null,null,null,null,null,null,null,48.0,100183,100183,"not available in this country",100183,100183,100183,100183,100183,100183,100183,"Not done","Not done","Not done","Not done","Not done","Not done","Not done",null,null,null,null,"Geiger SOLIDline Air 20Nm","Tubular Motor SOLIDline Air 20Nm","not available in this country","Moteurr SOLIDline Air 20Nm","Motor persiana SOLIDline Air 20Nm","Trubkový Motor SOLIDline Air 20Nm","Geiger SOLIDline Air 20Nm","Geiger SOLIDline Air 20Nm","Trubkový Motor SOLIDline Air 20Nm","Tubular Motor SOLIDline Air 20Nm","not translated yet","not translated yet","not translated yet","not translated yet","not translated yet","not translated yet","not translated yet",null,null,null,null,null,185,145,0,185,185,4999,185,230.56,185,185,"Not done","Not done","Not done","Not done","Not done","Not done","Not done"]
[100184.0,"Geiger SOLIDline Air 50Nm",215.0,null,null,100184.0,"Tubular Motor SOLIDline Air 50Nm",170.0,null,null,"not available in this country","not available in this country",0.0,null,null,100184.0,"Moteur SOLIDline Air 50Nm",215.0,null,null,100184.0,"Motor persiana SOLIDline Air 50Nm",215.0,null,null,100184.0,"Trubkový Motor SOLIDline Air 50Nm",5799.0,null,null,100184.0,"Geiger SOLIDline Air 50Nm",215.0,null,null,100184.0,"Geiger SOLIDline Air 50Nm",267.56,null,null,100184.0,"Trubkový Motor SOLIDline Air 50Nm",215.0,null,null,100184.0,"Tubular Motor SOLIDline Air 50Nm",215.0,null,null,"Not done","not translated yet","Not done",null,null,"Not done","not translated yet","Not done",null,"Not done","not translated yet","Not done",null,null,"Not done","not translated yet","Not done",null,null,"Not done","not translated yet","Not done",null,null,"Not done","not translated yet","Not done",null,null,"Not done","not translated yet","Not done",null,null,null,null,null,null,null,null,49.0,100184,100184,"not available in this country",100184,100184,100184,100184,100184,100184,100184,"Not done","Not done","Not done","Not done","Not done","Not done","Not done",null,null,null,null,"Geiger SOLIDline Air 50Nm","Tubular Motor SOLIDline Air 50Nm","not available in this country","Moteur SOLIDline Air 50Nm","Motor persiana SOLIDline Air 50Nm","Trubkový Motor SOLIDline Air 50Nm","Geiger SOLIDline Air 50Nm","Geiger SOLIDline Air 50Nm","Trubkový Motor SOLIDline Air 50Nm","Tubular Motor SOLIDline Air 50Nm","not translated yet","not translated yet","not translated yet","not translated yet","not translated yet","not translated yet","not translated yet",null,null,null,null,null,215,170,0,215,215,5799,215,267.56,215,215,"Not done","Not done","Not done","Not done","Not done","Not done","Not done"]
[200001.0,"Netzteil 24V, 1,3A",35.86,null,null,200001.0,"24V Power Supply (1.3A)",32.5,null,null,200001.0,"24V Power Supply (1.3A)",49.0,null,null,200001.0,"Alimentation 24V (1.3A)",35.86,null,null,200001.0,"Fuente de alimentación 24V, 1,3A",35.86,null,null,200001.0,"24V Zdroj (1.3A)",908.26,null,null,200001.0,"Alimentatore 24V 1,3A",35.86,null,null,200001.0,"Netzteil 24V, 1,3A",46.25,null,null,200001.0,"24V Zdroj (1.3A)",35.86,null,null,200001.0,"24V Voeding (1.3A)",35.86,null,null,"Not done","not translated yet","Not done",null,null,"Not done","not translated yet","Not done",null,"Not done","not translated yet","Not done",null,null,"Not done","not translated yet","Not done",null,null,"Not done","not translated yet","Not done",null,null,"Not done","not translated yet","Not done",null,null,"Not done","not translated yet","Not done",null,null,null,null,null,null,null,null,50.0,200001,200001,200001,200001,200001,200001,200001,200001,200001,200001,"Not done","Not done","Not done","Not done","Not done","Not done","Not done",null,null,null,null,"Netzteil 24V, 1,3A","24V Power Supply (1.3A)","24V Power Supply (1.3A)","Alimentation 24V (1.3A)","Fuente de alimentación 24V, 1,3A","24V Zdroj (1.3A)","Alimentatore 24V 1,3A","Netzteil 24V, 1,3A","24V Zdroj (1.3A)","24V Voeding (1.3A)","not translated yet","not translated yet","not translated yet","not translated yet","not translated yet","not translated yet","not translated yet",null,null,null,null,null,35.86,32.5,49,35.86,35.86,908.26,35.86,46.25,35.86,35.86,"Not done","Not done","Not done","Not done","Not done","Not done","Not done"]
[200002.0,"Netzteil 24V, 4,2A",55.81,null,null,200002.0,"24V Power Supply (4.2A)",47.5,null,null,200002.0,"24V Power Supply (4.2A)",76.0,null,null,200002.0,"Alimentation 24V (4.2A)",55.81,null,null,200002.0,"Fuente de alimentación 24V, 4,2A",55.81,null,null,200002.0,"24V Zdroj (4.2A)",1404.13,null,null,200002.0,"Alimentatore 24V 4,2A",55.81,null,null,200002.0,"Netzteil 24V, 4,2A",71.25,null,null,200002.0,"24V Zdroj (4.2A)",55.81,null,null,200002.0,"24V Voeding (4.2A)",55.81,null,null,"Not done","not translated yet","Not done",null,null,"Not done","not translated yet","Not done",null,"Not done","not translated yet","Not done",null,null,"Not done","not translated yet","Not done",null,null,"Not done","not translated yet","Not done",null,null,"Not done","not translated yet","Not done",null,null,"Not done","not translated yet","Not done",null,null,null,null,null,null,null,null,51.0,200002,200002,200002,200002,200002,200002,200002,200002,200002,200002,"Not done","Not done","Not done","Not done","Not done","Not done","Not done",null,null,null,null,"Netzteil 24V, 4,2A","24V Power Supply (4.2A)","24V Power Supply (4.2A)","Alimentation 24V (4.2A)","Fuente de alimentación 24V, 4,2A","24V Zdroj (4.2A)","Alimentatore 24V 4,2A","Netzteil 24V, 4,2A","24V Zdroj (4.2A)","24V Voeding (4.2A)","not translated yet","not translated yet","not translated yet","not translated yet","not translated yet","not translated yet","not translated yet",null,null,null,null,null,55.81,47.5,76,55.81,55.81,1404.13,55.81,71.25,55.81,55.81,"Not done","Not done","Not done","Not done","Not done","Not done","Not done"]
[200003.0,"Temperaturfühler Außen",41.6,null,null,200003.0,"Outside Temperature Sensor 0-10V",37.5,null,null,200003.0,"Outside Temperature Sensor 0-10V",59.0,null,null,200003.0,"Sonde de température Extérieur 0-10V",41.6,null,null,200003.0,"Sensor de temperatura para exterior",41.6,null,null,200003.0,"Venkovní senzor teploty",1032.23,null,null,200003.0,"Sensore temperatura esterno 0-10V",41.6,null,null,200003.0,"Temperaturfühler Außen",49.95,null,null,200003.0,"Vonkajší teplotný senzor",41.6,null,null,200003.0,"Buitentemperatuur voeler 0-10V",41.6,null,null,"Not done","not translated yet","Not done",null,null,"Not done","not translated yet","Not done",null,"Not done","not translated yet","Not done",null,null,"Not done","not translated yet","Not done",null,null,"Not done","not translated yet","Not done",null,null,"Not done","not translated yet","Not done",null,null,"Not done","not translated yet","Not done",null,null,null,null,null,null,null,null,52.0,200003,200003,200003,200003,200003,200003,200003,200003,200003,200003,"Not done","Not done","Not done","Not done","Not done","Not done","Not done",null,null,null,null,"Temperaturfühler Außen","Outside Temperature Sensor 0-10V","Outside Temperature Sensor 0-10V","Sonde de température Extérieur 0-10V","Sensor de temperatura para exterior","Venkovní senzor teploty","Sensore temperatura esterno 0-10V","Temperaturfühler Außen","Vonkajší teplotný senzor","Buitentemperatuur voeler 0-10V","not translated yet","not translated yet","not translated yet","not translated yet","not translated yet","not translated yet","not translated yet",null,null,null,null,null,41.6,37.5,59,41.6,41.6,1032.23,41.6,49.95,41.6,41.6,"Not done","Not done","Not done","Not done","Not done","Not done","Not done"]
[0.0,"No longer sold",0.0,null,null,0.0,"No longer sold",0.0,null,null,0.0,"No longer sold",0.0,null,null,0.0,"No longer sold",0.0,null,null,0.0,"No longer sold",0.0,null,null,0.0,"No longer sold",0.0,null,null,0.0,"No longer sold",0.0,null,null,0.0,"No longer sold",0.0,null,null,0.0,"No longer sold",0.0,null,null,0.0,"No longer sold",0.0,null,null,"Not done","not translated yet","Not done",null,null,"Not done","not translated yet","Not done",null,"Not done","not translated yet","Not done",null,null,"Not done","not translated yet","Not done",null,null,"Not done","not translated yet","Not done",null,null,"Not done","not translated yet","Not done",null,null,"Not done","not translated yet","Not done",null,null,null,null,null,null,null,null,53.0,0,0,0,0,0,0,0,0,0,0,"Not done","Not done","Not done","Not done","Not done","Not done","Not done",null,null,null,null,"No longer sold","No longer sold","No longer sold","No longer sold","No longer sold","No longer sold","No longer sold","No longer sold","No longer sold","No longer sold","not translated yet","not translated yet","not translated yet","not translated yet","not translated yet","not translated yet","not translated yet",null,null,null,null,null,0,0,0,0,0,0,0,0,0,0,"Not done","Not done","Not done","Not done","Not done","Not done","Not done"]
[0.0,"No longer sold",0.0,null,null,0.0,"No longer sold",0.0,null,null,0.0,"No longer sold",0.0,null,null,0.0,"No longer sold",0.0,null,null,0.0,"No longer sold",0.0,null,null,0.0,"No longer sold",0.0,null,null,0.0,"No longer sold",0.0,null,null,0.0,"No longer sold",0.0,null,null,0.0,"No longer sold",0.0,null,null,0.0,"No longer sold",0.0,null,null,"Not done","not translated yet","Not done",null,null,"Not done","not translated yet","Not done",null,"Not done","not translated yet","Not done",null,null,"Not done","not translated yet","Not done",null,null,"Not done","not translated yet","Not done",null,null,"Not done","not translated yet","Not done",null,null,"Not done","not translated yet","Not done",null,null,null,null,null,null,null,null,54.0,0,0,0,0,0,0,0,0,0,0,"Not done","Not done","Not done","Not done","Not done","Not done","Not done",null,null,null,null,"No longer sold","No longer sold","No longer sold","No longer sold","No longer sold","No longer sold","No longer sold","No longer sold","No longer sold","No longer sold","not translated yet","not translated yet","not translated yet","not translated yet","not translated yet","not translated yet","not translated yet",null,null,null,null,null,0,0,0,0,0,0,0,0,0,0,"Not done","Not done","Not done","Not done","Not done","Not done","Not done"]
[200006.0,"Temperaturfühler Wohnraum",41.6,null,null,200006.0,"Indoor Temperature Sensor 0-10V",37.5,null,null,200006.0,"Indoor Temperature Sensor 0-10V",59.0,null,null,200006.0,"Sonde de température intérieur 0-10V",41.6,null,null,200006.0,"Sensor de temperatura para interior 0-10V",41.6,null,null,200006.0,"Vnitřní teplotní senzor 0-10V",1032.23,null,null,200006.0,"Sensore temperatura interno 0-10V",41.6,null,null,200006.0,"Temperaturfühler Wohnraum",53.66,null,null,200006.0,"Vnitřní teplotní senzor 0-10V",41.6,null,null,200006.0,"Binnentemperatuur voeler 0-10V",41.6,null,null,"Not done","not translated yet","Not done",null,null,"Not done","not translated yet","Not done",null,"Not done","not translated yet","Not done",null,null,"Not done","not translated yet","Not done",null,null,"Not done","not translated yet","Not done",null,null,"Not done","not translated yet","Not done",null,null,"Not done","not translated yet","Not done",null,null,null,null,null,null,null,null,55.0,200006,200006,200006,200006,200006,200006,200006,200006,200006,200006,"Not done","Not done","Not done","Not done","Not done","Not done","Not done",null,null,null,null,"Temperaturfühler Wohnraum","Indoor Temperature Sensor 0-10V","Indoor Temperature Sensor 0-10V","Sonde de température intérieur 0-10V","Sensor de temperatura para interior 0-10V","Vnitřní teplotní senzor 0-10V","Sensore temperatura interno 0-10V","Temperaturfühler Wohnraum","Vnitřní teplotní senzor 0-10V","Binnentemperatuur voeler 0-10V","not translated yet","not translated yet","not translated yet","not translated yet","not translated yet","not translated yet","not translated yet",null,null,null,null,null,41.6,37.5,59,41.6,41.6,1032.23,41.6,53.66,41.6,41.6,"Not done","Not done","Not done","Not done","Not done","Not done","Not done"]
[200007.0,"Wireless-G Router",24.92,null,null,"NA","not available in this country",0.0,null,null,"not available in this country","not available in this country",0.0,null,null,200007.0,"Routeur Wifi - Netgear",24.92,null,null,200007.0,"Wireless-G Router",24.92,null,null,"not available in this country","not available in this country",0.0,null,null,200007.0,"Wireless-G Router",24.92,null,null,200007.0,"Wireless-G Router",33.29,null,null,"not available in this country","not available in this country",0.0,null,null,200007.0,"Wireless-N Router",24.92,null,null,"Not done","not translated yet","Not done",null,null,"Not done","not translated yet","Not done",null,"Not done","not translated yet","Not done",null,null,"Not done","not translated yet","Not done",null,null,"Not done","not translated yet","Not done",null,null,"Not done","not translated yet","Not done",null,null,"Not done","not translated yet","Not done",null,null,null,null,null,null,null,null,56.0,200007,"NA","not available in this country",200007,200007,"not available in this country",200007,200007,"not available in this country",200007,"Not done","Not done","Not done","Not done","Not done","Not done","Not done",null,null,null,null,"Wireless-G Router","not available in this country","not available in this country","Routeur Wifi - Netgear","Wireless-G Router","not available in this country","Wireless-G Router","Wireless-G Router","not available in this country","Wireless-N Router","not translated yet","not translated yet","not translated yet","not translated yet","not translated yet","not translated yet","not translated yet",null,null,null,null,null,24.92,0,0,24.92,24.92,0,24.92,33.29,0,24.92,"Not done","Not done","Not done","Not done","Not done","Not done","Not done"]
[200010.0,"Temperatur/Feuchte Wohnraum",87.4,null,null,200010.0,"Indoor Temperature & Humidity Sensor 0-10V",77.5,null,null,200010.0,"Indoor Temperature & Humidity Sensor 0-10V",119.0,null,null,200010.0,"Sonde de Temp & Hum intérieur 0-10V",87.4,null,null,200010.0,"Sensor de temperatura y humedad para interior 0-10V",87.4,null,null,200010.0,"Senzor teploty a vlhkosti (vnitřní) 0-10V",2189.26,null,null,200010.0,"Temperatura/umidità interno 0-10V",87.4,null,null,200010.0,"Temperatur/Feuchte Wohnraum",100.93,null,null,200010.0,"Senzor teploty a vlhkosti (vnitřní) 0-10V",87.4,null,null,200010.0,"Binnentemperatuur & Vochtigheid Voeler Sensor 0-10V",87.4,null,null,"Not done","not translated yet","Not done",null,null,"Not done","not translated yet","Not done",null,"Not done","not translated yet","Not done",null,null,"Not done","not translated yet","Not done",null,null,"Not done","not translated yet","Not done",null,null,"Not done","not translated yet","Not done",null,null,"Not done","not translated yet","Not done",null,null,null,null,null,null,null,null,57.0,200010,200010,200010,200010,200010,200010,200010,200010,200010,200010,"Not done","Not done","Not done","Not done","Not done","Not done","Not done",null,null,null,null,"Temperatur/Feuchte Wohnraum","Indoor Temperature & Humidity Sensor 0-10V","Indoor Temperature & Humidity Sensor 0-10V","Sonde de Temp & Hum intérieur 0-10V","Sensor de temperatura y humedad para interior 0-10V","Senzor teploty a vlhkosti (vnitřní) 0-10V","Temperatura/umidità interno 0-10V","Temperatur/Feuchte Wohnraum","Senzor teploty a vlhkosti (vnitřní) 0-10V","Binnentemperatuur & Vochtigheid Voeler Sensor 0-10V","not translated yet","not translated yet","not translated yet","not translated yet","not translated yet","not translated yet","not translated yet",null,null,null,null,null,87.4,77.5,119,87.4,87.4,2189.26,87.4,100.93,87.4,87.4,"Not done","Not done","Not done","Not done","Not done","Not done","Not done"]
[200012.0,"Ventiladapter VA80",1.19,null,null,200012.0,"Valve Adaptor VA80",1.0,null,null,200012.0,"Valve Adaptor VA80",2.0,null,null,200012.0,"Adaptateur vanne VA80",1.19,null,null,200012.0,"Adaptador para válvula VA80",1.19,null,null,200012.0,"Adaptér ventilu VA80",29.75,null,null,200012.0,"Adattore valvola VA80",1.19,null,null,200012.0,"Ventiladapter VA80",1.62,null,null,200012.0,"Adaptér ventilu VA80",1.19,null,null,200012.0,"Ventieladapter VA80",1.19,null,null,"Not done","not translated yet","Not done",null,null,"Not done","not translated yet","Not done",null,"Not done","not translated yet","Not done",null,null,"Not done","not translated yet","Not done",null,null,"Not done","not translated yet","Not done",null,null,"Not done","not translated yet","Not done",null,null,"Not done","not translated yet","Not done",null,null,null,null,null,null,null,null,58.0,200012,200012,200012,200012,200012,200012,200012,200012,200012,200012,"Not done","Not done","Not done","Not done","Not done","Not done","Not done",null,null,null,null,"Ventiladapter VA80","Valve Adaptor VA80","Valve Adaptor VA80","Adaptateur vanne VA80","Adaptador para válvula VA80","Adaptér ventilu VA80","Adattore valvola VA80","Ventiladapter VA80","Adaptér ventilu VA80","Ventieladapter VA80","not translated yet","not translated yet","not translated yet","not translated yet","not translated yet","not translated yet","not translated yet",null,null,null,null,null,1.19,1,2,1.19,1.19,29.75,1.19,1.62,1.19,1.19,"Not done","Not done","Not done","Not done","Not done","Not done","Not done"]
[200013.0,"Micro-SD Karte",6.4,null,null,"NA","not available in this country",0.0,null,null,"not available in this country","not available in this country",0.0,null,null,"not available in this country","not available in this country",null,null,null,200013.0,"Tarjeta Micro-SD",6.4,null,null,"not available in this country","not available in this country",0.0,null,null,200013.0,"Scheda micro SD",6.4,null,null,40.0,"Micro-SD Karte",6.71,null,null,"not available in this country","not available in this country",0.0,null,null,200013.0,"Micro SD Kaart",6.4,null,null,"Not done","not translated yet","Not done",null,null,"Not done","not translated yet","Not done",null,"Not done","not translated yet","Not done",null,null,"Not done","not translated yet","Not done",null,null,"Not done","not translated yet","Not done",null,null,"Not done","not translated yet","Not done",null,null,"Not done","not translated yet","Not done",null,null,null,null,null,null,null,null,59.0,200013,"NA","not available in this country","not available in this country",200013,"not available in this country",200013,40,"not available in this country",200013,"Not done","Not done","Not done","Not done","Not done","Not done","Not done",null,null,null,null,"Micro-SD Karte","not available in this country","not available in this country","not available in this country","Tarjeta Micro-SD","not available in this country","Scheda micro SD","Micro-SD Karte","not available in this country","Micro SD Kaart","not translated yet","not translated yet","not translated yet","not translated yet","not translated yet","not translated yet","not translated yet",null,null,null,null,null,6.4,0,0,"",6.4,0,6.4,6.71,0,6.4,"Not done","Not done","Not done","Not done","Not done","Not done","Not done"]
[200017.0,"Temperatur/Feuchte/ CO2",229.9,null,null,200017.0,"Indoor Temperature, Humidty & CO2 Sensor 0-10V",197.5,null,null,200017.0,"Indoor Temperature, Humidty & CO2 Sensor 0-10V",314.0,null,null,200017.0,"Capteur Temp / hum / CO2 intérieur 0-10V",229.9,null,null,200017.0,"Sensor CO2, temperatura y humedad",229.9,null,null,200017.0,"Senzor CO2/Teplota/Vlhkost",5784.3,null,null,200017.0,"Temperatura/umidità/CO2",229.9,null,null,200017.0,"Temperatur/Feuchte/ CO2",286.11,null,null,200017.0,"Senzor CO2/Teplota/Vlhkost",229.9,null,null,200017.0,"Binnentemperatuur/Vochtigheid/CO2 Voeler 0-10V",229.9,null,null,"Not done","not translated yet","Not done",null,null,"Not done","not translated yet","Not done",null,"Not done","not translated yet","Not done",null,null,"Not done","not translated yet","Not done",null,null,"Not done","not translated yet","Not done",null,null,"Not done","not translated yet","Not done",null,null,"Not done","not translated yet","Not done",null,null,null,null,null,null,null,null,60.0,200017,200017,200017,200017,200017,200017,200017,200017,200017,200017,"Not done","Not done","Not done","Not done","Not done","Not done","Not done",null,null,null,null,"Temperatur/Feuchte/ CO2","Indoor Temperature, Humidty & CO2 Sensor 0-10V","Indoor Temperature, Humidty & CO2 Sensor 0-10V","Capteur Temp / hum / CO2 intérieur 0-10V","Sensor CO2, temperatura y humedad","Senzor CO2/Teplota/Vlhkost","Temperatura/umidità/CO2","Temperatur/Feuchte/ CO2","Senzor CO2/Teplota/Vlhkost","Binnentemperatuur/Vochtigheid/CO2 Voeler 0-10V","not translated yet","not translated yet","not translated yet","not translated yet","not translated yet","not translated yet","not translated yet",null,null,null,null,null,229.9,197.5,314,229.9,229.9,5784.3,229.9,286.11,229.9,229.9,"Not done","Not done","Not done","Not done","Not done","Not done","Not done"]
[200018.0,"Regensensor 24V",57.9,null,null,200018.0,"Rain Sensor (24V)",55.0,null,null,200018.0,"Rain Sensor (24V)",79.0,null,null,200018.0,"Capteur de pluie 24V",57.9,null,null,200018.0,"Sensor de lluvia 24V",57.9,null,null,200018.0,"Dešťový senzor (24V)",1445.45,null,null,200018.0,"Sensore pioggia 24V",57.9,null,null,200018.0,"Regensensor 24V",74.03,null,null,200018.0,"Dešťový senzor (24V)",57.9,null,null,200018.0,"RegenSensor (24V)",57.9,null,null,"Not done","not translated yet","Not done",null,null,"Not done","not translated yet","Not done",null,"Not done","not translated yet","Not done",null,null,"Not done","not translated yet","Not done",null,null,"Not done","not translated yet","Not done",null,null,"Not done","not translated yet","Not done",null,null,"Not done","not translated yet","Not done",null,null,null,null,null,null,null,null,61.0,200018,200018,200018,200018,200018,200018,200018,200018,200018,200018,"Not done","Not done","Not done","Not done","Not done","Not done","Not done",null,null,null,null,"Regensensor 24V","Rain Sensor (24V)","Rain Sensor (24V)","Capteur de pluie 24V","Sensor de lluvia 24V","Dešťový senzor (24V)","Sensore pioggia 24V","Regensensor 24V","Dešťový senzor (24V)","RegenSensor (24V)","not translated yet","not translated yet","not translated yet","not translated yet","not translated yet","not translated yet","not translated yet",null,null,null,null,null,57.9,55,79,57.9,57.9,1445.45,57.9,74.03,57.9,57.9,"Not done","Not done","Not done","Not done","Not done","Not done","Not done"]
[200031.0,"Temperatur/Feuchte Außen",116.9,null,null,200031.0,"Outdoor Temperature & Humidy Sensor 0-10V",103.75,null,null,200031.0,"Outdoor Temperature & Humidy Sensor 0-10V",159.0,null,null,200031.0,"Sonde Temp & Hum Exterieur",116.9,null,null,200031.0,"Sensor de temperatura y humedad exterior 0-10V",116.9,null,null,200031.0,"Senzor teploty a vlhkosti (venkovní)",2933.06,null,null,200031.0,"Temperatura/umidità esterno",116.9,null,null,200031.0,"Temperatur/Feuchte Außen",147.22,null,null,200031.0,"Senzor teploty a vlhkosti (venkovní)",116.9,null,null,200031.0,"Buitentemperatuur & Vochtigheidsvoeler",116.9,null,null,"Not done","not translated yet","Not done",null,null,"Not done","not translated yet","Not done",null,"Not done","not translated yet","Not done",null,null,"Not done","not translated yet","Not done",null,null,"Not done","not translated yet","Not done",null,null,"Not done","not translated yet","Not done",null,null,"Not done","not translated yet","Not done",null,null,null,null,null,null,null,null,62.0,200031,200031,200031,200031,200031,200031,200031,200031,200031,200031,"Not done","Not done","Not done","Not done","Not done","Not done","Not done",null,null,null,null,"Temperatur/Feuchte Außen","Outdoor Temperature & Humidy Sensor 0-10V","Outdoor Temperature & Humidy Sensor 0-10V","Sonde Temp & Hum Exterieur","Sensor de temperatura y humedad exterior 0-10V","Senzor teploty a vlhkosti (venkovní)","Temperatura/umidità esterno","Temperatur/Feuchte Außen","Senzor teploty a vlhkosti (venkovní)","Buitentemperatuur & Vochtigheidsvoeler","not translated yet","not translated yet","not translated yet","not translated yet","not translated yet","not translated yet","not translated yet",null,null,null,null,null,116.9,103.75,159,116.9,116.9,2933.06,116.9,147.22,116.9,116.9,"Not done","Not done","Not done","Not done","Not done","Not done","Not done"]
[200032.0,"Helligkeitssensor 0-10V",79.9,null,null,200032.0,"Brightness Sensor 0-10V",70.0,null,null,200032.0,"Brightness Sensor 0-10V",109.0,null,null,200032.0,"Capteur de luminosité 24V",79.9,null,null,200032.0,"Sensor de luminosidad 0-10V",79.9,null,null,200032.0,"Senzor osvětlení 0-10V",1982.64,null,null,200032.0,"Sensore di luminosità 0-10V",79.9,null,null,200032.0,"Helligkeitssensor 0-10V",100.93,null,null,200032.0,"Senzor osvětlení 0-10V",79.9,null,null,200032.0,"Helderheid Sensor 0-10V",79.9,null,null,"Not done","not translated yet","Not done",null,null,"Not done","not translated yet","Not done",null,"Not done","not translated yet","Not done",null,null,"Not done","not translated yet","Not done",null,null,"Not done","not translated yet","Not done",null,null,"Not done","not translated yet","Not done",null,null,"Not done","not translated yet","Not done",null,null,null,null,null,null,null,null,63.0,200032,200032,200032,200032,200032,200032,200032,200032,200032,200032,"Not done","Not done","Not done","Not done","Not done","Not done","Not done",null,null,null,null,"Helligkeitssensor 0-10V","Brightness Sensor 0-10V","Brightness Sensor 0-10V","Capteur de luminosité 24V","Sensor de luminosidad 0-10V","Senzor osvětlení 0-10V","Sensore di luminosità 0-10V","Helligkeitssensor 0-10V","Senzor osvětlení 0-10V","Helderheid Sensor 0-10V","not translated yet","not translated yet","not translated yet","not translated yet","not translated yet","not translated yet","not translated yet",null,null,null,null,null,79.9,70,109,79.9,79.9,1982.64,79.9,100.93,79.9,79.9,"Not done","Not done","Not done","Not done","Not done","Not done","Not done"]
[200033.0,"Windsensor 24V",73.2,null,null,200033.0,"Wind Sensor (24V)",66.25,null,null,200033.0,"Wind Sensor (24V)",99.0,null,null,200033.0,"Anémomètre 24V",73.2,null,null,200033.0,"Anemómetro 24V",73.2,null,null,200033.0,"Senzor větru (24V)",1817.36,null,null,200033.0,"Sensore del vento 24V",73.2,null,null,200033.0,"Windsensor 24V",89.77,null,null,200033.0,"Senzor větru (24V)",73.2,null,null,200033.0,"Wind Sensor (24V)",73.2,null,null,"Not done","not translated yet","Not done",null,null,"Not done","not translated yet","Not done",null,"Not done","not translated yet","Not done",null,null,"Not done","not translated yet","Not done",null,null,"Not done","not translated yet","Not done",null,null,"Not done","not translated yet","Not done",null,null,"Not done","not translated yet","Not done",null,null,null,null,null,null,null,null,64.0,200033,200033,200033,200033,200033,200033,200033,200033,200033,200033,"Not done","Not done","Not done","Not done","Not done","Not done","Not done",null,null,null,null,"Windsensor 24V","Wind Sensor (24V)","Wind Sensor (24V)","Anémomètre 24V","Anemómetro 24V","Senzor větru (24V)","Sensore del vento 24V","Windsensor 24V","Senzor větru (24V)","Wind Sensor (24V)","not translated yet","not translated yet","not translated yet","not translated yet","not translated yet","not translated yet","not translated yet",null,null,null,null,null,73.2,66.25,99,73.2,73.2,1817.36,73.2,89.77,73.2,73.2,"Not done","Not done","Not done","Not done","Not done","Not done","Not done"]
[200034.0,"Halterung für Windsensor",55.0,null,null,200034.0,"Wind Sensor Mount",47.5,null,null,200034.0,"Wind Sensor Mount",75.0,null,null,200034.0,"Socle anémomètre",55.0,null,null,200034.0,"Soporte para sensor de viento",55.0,null,null,200034.0,"Držák pro senzor větru",1362.81,null,null,200034.0,"Supporto per sensore del vento",55.0,null,null,200034.0,"Halterung für Windsensor",70.32,null,null,200034.0,"Držák pro senzor větru",55.0,null,null,200034.0,"Wind Sensor Muurbevestiging",55.0,null,null,"Not done","not translated yet","Not done",null,null,"Not done","not translated yet","Not done",null,"Not done","not translated yet","Not done",null,null,"Not done","not translated yet","Not done",null,null,"Not done","not translated yet","Not done",null,null,"Not done","not translated yet","Not done",null,null,"Not done","not translated yet","Not done",null,null,null,null,null,null,null,null,65.0,200034,200034,200034,200034,200034,200034,200034,200034,200034,200034,"Not done","Not done","Not done","Not done","Not done","Not done","Not done",null,null,null,null,"Halterung für Windsensor","Wind Sensor Mount","Wind Sensor Mount","Socle anémomètre","Soporte para sensor de viento","Držák pro senzor větru","Supporto per sensore del vento","Halterung für Windsensor","Držák pro senzor větru","Wind Sensor Muurbevestiging","not translated yet","not translated yet","not translated yet","not translated yet","not translated yet","not translated yet","not translated yet",null,null,null,null,null,55,47.5,75,55,55,1362.81,55,70.32,55,55,"Not done","Not done","Not done","Not done","Not done","Not done","Not done"]
[200035.0,"Netzteil 24V, 10A",129.9,null,null,200035.0,"24V Power Supply (10A)",112.5,null,null,200035.0,"24V Power Supply (10A)",179.0,null,null,200035.0,"Alimentation 24V 10A",129.9,null,null,200035.0,"Fuente de alimentación 24V, 10A",129.9,null,null,200035.0,"24V Zdroj (10A)",3304.96,null,null,200035.0,"Alimentatore 24V 10A",129.9,null,null,200035.0,"Netzteil 24V, 10A",165.74,null,null,200035.0,"24V Zdroj (10A)",129.9,null,null,200035.0,"24V Voeding (10A)",129.9,null,null,"Not done","not translated yet","Not done",null,null,"Not done","not translated yet","Not done",null,"Not done","not translated yet","Not done",null,null,"Not done","not translated yet","Not done",null,null,"Not done","not translated yet","Not done",null,null,"Not done","not translated yet","Not done",null,null,"Not done","not translated yet","Not done",null,null,null,null,null,null,null,null,66.0,200035,200035,200035,200035,200035,200035,200035,200035,200035,200035,"Not done","Not done","Not done","Not done","Not done","Not done","Not done",null,null,null,null,"Netzteil 24V, 10A","24V Power Supply (10A)","24V Power Supply (10A)","Alimentation 24V 10A","Fuente de alimentación 24V, 10A","24V Zdroj (10A)","Alimentatore 24V 10A","Netzteil 24V, 10A","24V Zdroj (10A)","24V Voeding (10A)","not translated yet","not translated yet","not translated yet","not translated yet","not translated yet","not translated yet","not translated yet",null,null,null,null,null,129.9,112.5,179,129.9,129.9,3304.96,129.9,165.74,129.9,129.9,"Not done","Not done","Not done","Not done","Not done","Not done","Not done"]
[200039.0,"Präsenzmelder 24V",104.9,null,null,200039.0,"Presence Sensor (24V)",93.75,null,null,"not available in this country","not available in this country",0.0,null,null,200039.0,"Détecteur de mouvement 24V",104.9,null,null,200039.0,"Detector de presencia para interior 24V",104.9,null,null,200039.0,"Senzor přítomnosti (24V) vnitřní",2799.0,null,null,200039.0,"Sensore di presenza 24V",104.9,null,null,200039.0,"Präsenzmelder 24V",128.7,null,null,200039.0,"Senzor přítomnosti (24V) vnitřní",104.9,null,null,200039.0,"Aanwezigheidsmelder (24V)",104.9,null,null,"Not done","not translated yet","Not done",null,null,"Not done","not translated yet","Not done",null,"Not done","not translated yet","Not done",null,null,"Not done","not translated yet","Not done",null,null,"Not done","not translated yet","Not done",null,null,"Not done","not translated yet","Not done",null,null,"Not done","not translated yet","Not done",null,null,null,null,null,null,null,null,67.0,200039,200039,"not available in this country",200039,200039,200039,200039,200039,200039,200039,"Not done","Not done","Not done","Not done","Not done","Not done","Not done",null,null,null,null,"Präsenzmelder 24V","Presence Sensor (24V)","not available in this country","Détecteur de mouvement 24V","Detector de presencia para interior 24V","Senzor přítomnosti (24V) vnitřní","Sensore di presenza 24V","Präsenzmelder 24V","Senzor přítomnosti (24V) vnitřní","Aanwezigheidsmelder (24V)","not translated yet","not translated yet","not translated yet","not translated yet","not translated yet","not translated yet","not translated yet",null,null,null,null,null,104.9,93.75,0,104.9,104.9,2799,104.9,128.7,104.9,104.9,"Not done","Not done","Not done","Not done","Not done","Not done","Not done"]
[200040.0,"Aufputzdose IP 20 weiß",6.9,null,null,200040.0,"Surface Mount Box - IP20",6.25,null,null,200040.0,"Surface Mount Box - IP20",10.0,null,null,200040.0,"Surface Mount Box - IP20",6.9,null,null,200040.0,"Caja para montaje superficial IP 20 blanca",6.9,null,null,200040.0,"Instalační krabice IP20 bílá",229.0,null,null,200040.0,"Scatola sporgente IP 20 bianco",6.9,null,null,"not available in this country","not available in this country",0.0,null,null,200040.0,"Instalační krabice IP20 bílá",6.9,null,null,200040.0,"Opbouwdoos - IP20 - Wit",6.9,null,null,"Not done","not translated yet","Not done",null,null,"Not done","not translated yet","Not done",null,"Not done","not translated yet","Not done",null,null,"Not done","not translated yet","Not done",null,null,"Not done","not translated yet","Not done",null,null,"Not done","not translated yet","Not done",null,null,"Not done","not translated yet","Not done",null,null,null,null,null,null,null,null,68.0,200040,200040,200040,200040,200040,200040,200040,"not available in this country",200040,200040,"Not done","Not done","Not done","Not done","Not done","Not done","Not done",null,null,null,null,"Aufputzdose IP 20 weiß","Surface Mount Box - IP20","Surface Mount Box - IP20","Surface Mount Box - IP20","Caja para montaje superficial IP 20 blanca","Instalační krabice IP20 bílá","Scatola sporgente IP 20 bianco","not available in this country","Instalační krabice IP20 bílá","Opbouwdoos - IP20 - Wit","not translated yet","not translated yet","not translated yet","not translated yet","not translated yet","not translated yet","not translated yet",null,null,null,null,null,6.9,6.25,10,6.9,6.9,229,6.9,0,6.9,6.9,"Not done","Not done","Not done","Not done","Not done","Not done","Not done"]
[200042.0,"RGB LED Streifen 5m IP20",79.9,null,null,200042.0,"RGB LED Strip 5m",72.5,null,null,200042.0,"RGB LED Strip 5m",109.0,null,null,200042.0,"Ruban Led RGB 5m IP20",79.9,null,null,200042.0,"Tira LED RGB 5m IP20",79.9,null,null,200042.0,"5m RGB LED pásky IP20 (bez ochrany proti vodě)",2149.0,null,null,200042.0,"RGB strisce LED 5m IP20",79.9,null,null,200042.0,"RGB LED Streifen 5m IP20",70.65,null,null,200042.0,"5m RGB LED pásky IP20 (bez ochrany proti vodě)",79.9,null,null,200042.0,"RGB LED Strip 5m",79.9,null,null,"Not done","not translated yet","Not done",null,null,"Not done","not translated yet","Not done",null,"Not done","not translated yet","Not done",null,null,"Not done","not translated yet","Not done",null,null,"Not done","not translated yet","Not done",null,null,"Not done","not translated yet","Not done",null,null,"Not done","not translated yet","Not done",null,null,null,null,null,null,null,null,69.0,200042,200042,200042,200042,200042,200042,200042,200042,200042,200042,"Not done","Not done","Not done","Not done","Not done","Not done","Not done",null,null,null,null,"RGB LED Streifen 5m IP20","RGB LED Strip 5m","RGB LED Strip 5m","Ruban Led RGB 5m IP20","Tira LED RGB 5m IP20","5m RGB LED pásky IP20 (bez ochrany proti vodě)","RGB strisce LED 5m IP20","RGB LED Streifen 5m IP20","5m RGB LED pásky IP20 (bez ochrany proti vodě)","RGB LED Strip 5m","not translated yet","not translated yet","not translated yet","not translated yet","not translated yet","not translated yet","not translated yet",null,null,null,null,null,79.9,72.5,109,79.9,79.9,2149,79.9,70.65,79.9,79.9,"Not done","Not done","Not done","Not done","Not done","Not done","Not done"]
[200043.0,"LED Streifen Warmweiß IP20",79.9,null,null,200043.0,"Warm White LED Strip 5m",72.5,null,null,200043.0,"Warm White LED Strip 5m",109.0,null,null,200043.0,"Ruban Blanc Chaud 5m IP20",79.9,null,null,200043.0,"Tira LED blanco cálido IP20",79.9,null,null,200043.0,"5m LED pásky (teplá bílá) - IP20 (bez ochrany proti vodě)",2149.0,null,null,200043.0,"Strisce LED bianco caldo IP20",79.9,null,null,200043.0,"LED Streifen Warmweiß IP20",100.93,null,null,200043.0,"5m LED pásky (teplá bílá) - IP20 (bez ochrany proti vodě)",79.9,null,null,200043.0,"Warm Wit LED Strip 5m",79.9,null,null,"Not done","not translated yet","Not done",null,null,"Not done","not translated yet","Not done",null,"Not done","not translated yet","Not done",null,null,"Not done","not translated yet","Not done",null,null,"Not done","not translated yet","Not done",null,null,"Not done","not translated yet","Not done",null,null,"Not done","not translated yet","Not done",null,null,null,null,null,null,null,null,70.0,200043,200043,200043,200043,200043,200043,200043,200043,200043,200043,"Not done","Not done","Not done","Not done","Not done","Not done","Not done",null,null,null,null,"LED Streifen Warmweiß IP20","Warm White LED Strip 5m","Warm White LED Strip 5m","Ruban Blanc Chaud 5m IP20","Tira LED blanco cálido IP20","5m LED pásky (teplá bílá) - IP20 (bez ochrany proti vodě)","Strisce LED bianco caldo IP20","LED Streifen Warmweiß IP20","5m LED pásky (teplá bílá) - IP20 (bez ochrany proti vodě)","Warm Wit LED Strip 5m","not translated yet","not translated yet","not translated yet","not translated yet","not translated yet","not translated yet","not translated yet",null,null,null,null,null,79.9,72.5,109,79.9,79.9,2149,79.9,100.93,79.9,79.9,"Not done","Not done","Not done","Not done","Not done","Not done","Not done"]
[200045.0,"RGB LED Str. 5m IP65",84.9,null,null,200045.0,"RGB LED Strip 5m IP65",75.0,null,null,200045.0,"RGB LED Strip 5m IP65",122.0,null,null,200045.0,"Ruban Led RGB 5m IP65",84.9,null,null,200045.0,"Tira LED RGB 5m IP65",84.9,null,null,"not available in this country","not available in this country",0.0,null,null,200045.0,"RGB strisce LED 5m IP65",84.9,null,null,"not available in this country","not available in this country",0.0,null,null,"not available in this country","not available in this country",0.0,null,null,200045.0,"RGB LED Strip 5m IP65",84.9,null,null,"Not done","not translated yet","Not done",null,null,"Not done","not translated yet","Not done",null,"Not done","not translated yet","Not done",null,null,"Not done","not translated yet","Not done",null,null,"Not done","not translated yet","Not done",null,null,"Not done","not translated yet","Not done",null,null,"Not done","not translated yet","Not done",null,null,null,null,null,null,null,null,71.0,200045,200045,200045,200045,200045,"not available in this country",200045,"not available in this country","not available in this country",200045,"Not done","Not done","Not done","Not done","Not done","Not done","Not done",null,null,null,null,"RGB LED Str. 5m IP65","RGB LED Strip 5m IP65","RGB LED Strip 5m IP65","Ruban Led RGB 5m IP65","Tira LED RGB 5m IP65","not available in this country","RGB strisce LED 5m IP65","not available in this country","not available in this country","RGB LED Strip 5m IP65","not translated yet","not translated yet","not translated yet","not translated yet","not translated yet","not translated yet","not translated yet",null,null,null,null,null,84.9,75,122,84.9,84.9,0,84.9,0,0,84.9,"Not done","Not done","Not done","Not done","Not done","Not done","Not done"]
[200046.0,"RGB LED Streifen 5m IP68",89.9,null,null,200046.0,"RGB LED Strip 5m IP68",77.5,null,null,200046.0,"RGB LED Strip 5m IP68",122.0,null,null,200046.0,"Ruban led RGB 5m IP68",89.9,null,null,200046.0,"Tira LED RGB 5m IP68",89.9,null,null,200046.0,"5m RGB LED pásky IP68 (proti potopení do vody)",2499.0,null,null,200046.0,"RGB strisce LED 5m IP68",89.9,null,null,200046.0,"RGB LED Streifen 5m IP68",83.61,null,null,200046.0,"5m RGB LED pásky IP68 (proti potopení do vody)",89.9,null,null,200046.0,"RGB LED Strip 5m IP68",89.9,null,null,"Not done","not translated yet","Not done",null,null,"Not done","not translated yet","Not done",null,"Not done","not translated yet","Not done",null,null,"Not done","not translated yet","Not done",null,null,"Not done","not translated yet","Not done",null,null,"Not done","not translated yet","Not done",null,null,"Not done","not translated yet","Not done",null,null,null,null,null,null,null,null,72.0,200046,200046,200046,200046,200046,200046,200046,200046,200046,200046,"Not done","Not done","Not done","Not done","Not done","Not done","Not done",null,null,null,null,"RGB LED Streifen 5m IP68","RGB LED Strip 5m IP68","RGB LED Strip 5m IP68","Ruban led RGB 5m IP68","Tira LED RGB 5m IP68","5m RGB LED pásky IP68 (proti potopení do vody)","RGB strisce LED 5m IP68","RGB LED Streifen 5m IP68","5m RGB LED pásky IP68 (proti potopení do vody)","RGB LED Strip 5m IP68","not translated yet","not translated yet","not translated yet","not translated yet","not translated yet","not translated yet","not translated yet",null,null,null,null,null,89.9,77.5,122,89.9,89.9,2499,89.9,83.61,89.9,89.9,"Not done","Not done","Not done","Not done","Not done","Not done","Not done"]
[200048.0,"SMA Klebeantenne 868 MHz",14.9,null,null,200048.0,"SMA Antenna 868 MHz",13.75,null,null,200048.0,"SMA Antenna 868 MHz",19.0,null,null,200048.0,"Antenne SMA 868 MHz",14.9,null,null,200048.0,"Antena SMA 868 MHz",14.9,null,null,200048.0,"SMA anténa 868 MHz",371.9,null,null,200048.0,"SMA antenna 868 MHz",14.9,null,null,200048.0,"SMA Klebeantenne 868 MHz",20.32,null,null,200048.0,"SMA anténa 868 MHz",14.9,null,null,200048.0,"SMA Antenne 868 MHz",14.9,null,null,"Not done","not translated yet","Not done",null,null,"Not done","not translated yet","Not done",null,"Not done","not translated yet","Not done",null,null,"Not done","not translated yet","Not done",null,null,"Not done","not translated yet","Not done",null,null,"Not done","not translated yet","Not done",null,null,"Not done","not translated yet","Not done",null,null,null,null,null,null,null,null,73.0,200048,200048,200048,200048,200048,200048,200048,200048,200048,200048,"Not done","Not done","Not done","Not done","Not done","Not done","Not done",null,null,null,null,"SMA Klebeantenne 868 MHz","SMA Antenna 868 MHz","SMA Antenna 868 MHz","Antenne SMA 868 MHz","Antena SMA 868 MHz","SMA anténa 868 MHz","SMA antenna 868 MHz","SMA Klebeantenne 868 MHz","SMA anténa 868 MHz","SMA Antenne 868 MHz","not translated yet","not translated yet","not translated yet","not translated yet","not translated yet","not translated yet","not translated yet",null,null,null,null,null,14.9,13.75,19,14.9,14.9,371.9,14.9,20.32,14.9,14.9,"Not done","Not done","Not done","Not done","Not done","Not done","Not done"]
[200049.0,"Koppelrelais",15.9,null,null,200049.0,"Coupling Relay",13.75,null,null,200049.0,"Coupling Relay",23.0,null,null,200049.0,"Relai de couplage",15.9,null,null,200049.0,"Relé de acoplamiento de 16A",15.9,null,null,200049.0,"Spojovací relé",396.69,null,null,200049.0,"Relè di accoppiamento",15.9,null,null,200049.0,"Koppelrelais",20.32,null,null,200049.0,"Spojovací relé",15.9,null,null,200049.0,"Koppelrelais",15.9,null,null,"Not done","not translated yet","Not done",null,null,"Not done","not translated yet","Not done",null,"Not done","not translated yet","Not done",null,null,"Not done","not translated yet","Not done",null,null,"Not done","not translated yet","Not done",null,null,"Not done","not translated yet","Not done",null,null,"Not done","not translated yet","Not done",null,null,null,null,null,null,null,null,74.0,200049,200049,200049,200049,200049,200049,200049,200049,200049,200049,"Not done","Not done","Not done","Not done","Not done","Not done","Not done",null,null,null,null,"Koppelrelais","Coupling Relay","Coupling Relay","Relai de couplage","Relé de acoplamiento de 16A","Spojovací relé","Relè di accoppiamento","Koppelrelais","Spojovací relé","Koppelrelais","not translated yet","not translated yet","not translated yet","not translated yet","not translated yet","not translated yet","not translated yet",null,null,null,null,null,15.9,13.75,23,15.9,15.9,396.69,15.9,20.32,15.9,15.9,"Not done","Not done","Not done","Not done","Not done","Not done","Not done"]
[200050.0,"Loxone Aufkleber",2.9,null,null,200050.0,"Loxone Sticker",3.0,null,null,200050.0,"Loxone Sticker",5.0,null,null,200050.0,"Autocollants Loxone",2.9,null,null,200050.0,"Adhesivo Loxone",2.9,null,null,200050.0,"Loxone samolepky",73.55,null,null,200050.0,"Loxone sticker",2.9,null,null,200050.0,"Loxone Aufkleber",4.03,null,null,200050.0,"Loxone samolepky",2.9,null,null,200050.0,"Loxone Sticker",2.9,null,null,"Not done","not translated yet","Not done",null,null,"Not done","not translated yet","Not done",null,"Not done","not translated yet","Not done",null,null,"Not done","not translated yet","Not done",null,null,"Not done","not translated yet","Not done",null,null,"Not done","not translated yet","Not done",null,null,"Not done","not translated yet","Not done",null,null,null,null,null,null,null,null,75.0,200050,200050,200050,200050,200050,200050,200050,200050,200050,200050,"Not done","Not done","Not done","Not done","Not done","Not done","Not done",null,null,null,null,"Loxone Aufkleber","Loxone Sticker","Loxone Sticker","Autocollants Loxone","Adhesivo Loxone","Loxone samolepky","Loxone sticker","Loxone Aufkleber","Loxone samolepky","Loxone Sticker","not translated yet","not translated yet","not translated yet","not translated yet","not translated yet","not translated yet","not translated yet",null,null,null,null,null,2.9,3,5,2.9,2.9,73.55,2.9,4.03,2.9,2.9,"Not done","Not done","Not done","Not done","Not done","Not done","Not done"]
[200054.0,"Ultraschallsensor",209.9,null,null,200054.0,"Ultrasonic Sensor 0-10V",182.5,null,null,200054.0,"Ultrasonic Sensor 0-10V",289.0,null,null,200054.0,"Capteur ultrason 0-10V",209.9,null,null,200054.0,"Sensor de ultrasonidos 0-10V",209.9,null,null,200054.0,"Ultrazvukový senzor 0-10V",5247.11,null,null,200054.0,"Sensore a ultrasuoni",209.9,null,null,200054.0,"Ultraschallsensor",267.59,null,null,200054.0,"Ultrazvukový senzor 0-10V",209.9,null,null,200054.0,"Ultrasone Sensor 0-10V",209.9,null,null,"Not done","not translated yet","Not done",null,null,"Not done","not translated yet","Not done",null,"Not done","not translated yet","Not done",null,null,"Not done","not translated yet","Not done",null,null,"Not done","not translated yet","Not done",null,null,"Not done","not translated yet","Not done",null,null,"Not done","not translated yet","Not done",null,null,null,null,null,null,null,null,76.0,200054,200054,200054,200054,200054,200054,200054,200054,200054,200054,"Not done","Not done","Not done","Not done","Not done","Not done","Not done",null,null,null,null,"Ultraschallsensor","Ultrasonic Sensor 0-10V","Ultrasonic Sensor 0-10V","Capteur ultrason 0-10V","Sensor de ultrasonidos 0-10V","Ultrazvukový senzor 0-10V","Sensore a ultrasuoni","Ultraschallsensor","Ultrazvukový senzor 0-10V","Ultrasone Sensor 0-10V","not translated yet","not translated yet","not translated yet","not translated yet","not translated yet","not translated yet","not translated yet",null,null,null,null,null,209.9,182.5,289,209.9,209.9,5247.11,209.9,267.59,209.9,209.9,"Not done","Not done","Not done","Not done","Not done","Not done","Not done"]
[200057.0,"EnOcean Funktaster",45.9,null,null,200057.0,"Enocean Wireless Switch",41.25,null,null,"not available in this country","not available in this country",0.0,null,null,200057.0,"Bouton Poussoir Enocean",45.9,null,null,200057.0,"Pulsador inalámbrico EnOcean",45.9,null,null,200057.0,"Enocean Bezdrátové tlačítko",1249.0,null,null,200057.0,"EnOcean pulsante a radio",45.9,null,null,"not available in this country","not available in this country",0.0,null,null,200057.0,"Enocean Bezdrátové tlačítko",45.9,null,null,200057.0,"Enocean draadloze drukknop",45.9,null,null,"Not done","not translated yet","Not done",null,null,"Not done","not translated yet","Not done",null,"Not done","not translated yet","Not done",null,null,"Not done","not translated yet","Not done",null,null,"Not done","not translated yet","Not done",null,null,"Not done","not translated yet","Not done",null,null,"Not done","not translated yet","Not done",null,null,null,null,null,null,null,null,77.0,200057,200057,"not available in this country",200057,200057,200057,200057,"not available in this country",200057,200057,"Not done","Not done","Not done","Not done","Not done","Not done","Not done",null,null,null,null,"EnOcean Funktaster","Enocean Wireless Switch","not available in this country","Bouton Poussoir Enocean","Pulsador inalámbrico EnOcean","Enocean Bezdrátové tlačítko","EnOcean pulsante a radio","not available in this country","Enocean Bezdrátové tlačítko","Enocean draadloze drukknop","not translated yet","not translated yet","not translated yet","not translated yet","not translated yet","not translated yet","not translated yet",null,null,null,null,null,45.9,41.25,0,45.9,45.9,1249,45.9,0,45.9,45.9,"Not done","Not done","Not done","Not done","Not done","Not done","Not done"]
[200059.0,"EnOcean Fensterkontakt",79.9,null,null,200059.0,"Enocean Wireless Window Contact",68.75,null,null,"not available in this country","not available in this country",0.0,null,null,200059.0,"Contact d'ouverture Enocean",79.9,null,null,200059.0,"Contacto inalámbrico para puertas y ventanas EnOcean",79.9,null,null,200059.0,"Enocean Bezdrátový okenní kontakt",2149.0,null,null,200059.0,"EnOcean contatto finestra a radio",79.9,null,null,"not available in this country","not available in this country",0.0,null,null,200059.0,"Enocean Bezdrátový okenní kontakt",79.9,null,null,200059.0,"Enocean Draadloos Raamcontact",79.9,null,null,"Not done","not translated yet","Not done",null,null,"Not done","not translated yet","Not done",null,"Not done","not translated yet","Not done",null,null,"Not done","not translated yet","Not done",null,null,"Not done","not translated yet","Not done",null,null,"Not done","not translated yet","Not done",null,null,"Not done","not translated yet","Not done",null,null,null,null,null,null,null,null,78.0,200059,200059,"not available in this country",200059,200059,200059,200059,"not available in this country",200059,200059,"Not done","Not done","Not done","Not done","Not done","Not done","Not done",null,null,null,null,"EnOcean Fensterkontakt","Enocean Wireless Window Contact","not available in this country","Contact d'ouverture Enocean","Contacto inalámbrico para puertas y ventanas EnOcean","Enocean Bezdrátový okenní kontakt","EnOcean contatto finestra a radio","not available in this country","Enocean Bezdrátový okenní kontakt","Enocean Draadloos Raamcontact","not translated yet","not translated yet","not translated yet","not translated yet","not translated yet","not translated yet","not translated yet",null,null,null,null,null,79.9,68.75,0,79.9,79.9,2149,79.9,0,79.9,79.9,"Not done","Not done","Not done","Not done","Not done","Not done","Not done"]
[200061.0,"LED Str. WW 5m IP65",84.9,null,null,200061.0,"Warm White LED Strip 5m IP65",75.0,null,null,200061.0,"Warm White LED Strip 5m IP65",115.0,null,null,200061.0,"Ruban Blanc Chaud 5m IP65",84.9,null,null,200061.0,"Tira LED blanco cálido 5m IP65",84.9,null,null,200061.0,"5m LED pásky (teplá bílá) - IP65 (proti tryskající vodě)",2299.0,null,null,200061.0,"Strisce LED WW 5m IP65",84.9,null,null,200061.0,"LED Str. WW 5m IP65",110.19,null,null,200061.0,"5m LED pásky (teplá bílá) - IP65 (proti tryskající vodě)",84.9,null,null,200061.0,"Warm Wit LED Strip 5m IP65",84.9,null,null,"Not done","not translated yet","Not done",null,null,"Not done","not translated yet","Not done",null,"Not done","not translated yet","Not done",null,null,"Not done","not translated yet","Not done",null,null,"Not done","not translated yet","Not done",null,null,"Not done","not translated yet","Not done",null,null,"Not done","not translated yet","Not done",null,null,null,null,null,null,null,null,79.0,200061,200061,200061,200061,200061,200061,200061,200061,200061,200061,"Not done","Not done","Not done","Not done","Not done","Not done","Not done",null,null,null,null,"LED Str. WW 5m IP65","Warm White LED Strip 5m IP65","Warm White LED Strip 5m IP65","Ruban Blanc Chaud 5m IP65","Tira LED blanco cálido 5m IP65","5m LED pásky (teplá bílá) - IP65 (proti tryskající vodě)","Strisce LED WW 5m IP65","LED Str. WW 5m IP65","5m LED pásky (teplá bílá) - IP65 (proti tryskající vodě)","Warm Wit LED Strip 5m IP65","not translated yet","not translated yet","not translated yet","not translated yet","not translated yet","not translated yet","not translated yet",null,null,null,null,null,84.9,75,115,84.9,84.9,2299,84.9,110.19,84.9,84.9,"Not done","Not done","Not done","Not done","Not done","Not done","Not done"]
[200063.0,"Elektronischer Schlüssel Leser",9.08,null,null,200063.0,"iButton Reader 1-Wire",8.0,null,null,200063.0,"iButton Reader 1-Wire",13.0,null,null,200063.0,"Lecteur iButton",9.08,null,null,200063.0,"Lector de llaves electrónicas",9.08,null,null,200063.0,"Čtečka elektronického klíče",230.58,null,null,200063.0,"Lettore chiave elettronica",9.08,null,null,200063.0,"Elektronischer Schlüssel Leser",11.44,null,null,200063.0,"Čtečka elektronického klíče",9.08,null,null,200063.0,"iButton lezer 1-Wire",9.08,null,null,"Not done","not translated yet","Not done",null,null,"Not done","not translated yet","Not done",null,"Not done","not translated yet","Not done",null,null,"Not done","not translated yet","Not done",null,null,"Not done","not translated yet","Not done",null,null,"Not done","not translated yet","Not done",null,null,"Not done","not translated yet","Not done",null,null,null,null,null,null,null,null,80.0,200063,200063,200063,200063,200063,200063,200063,200063,200063,200063,"Not done","Not done","Not done","Not done","Not done","Not done","Not done",null,null,null,null,"Elektronischer Schlüssel Leser","iButton Reader 1-Wire","iButton Reader 1-Wire","Lecteur iButton","Lector de llaves electrónicas","Čtečka elektronického klíče","Lettore chiave elettronica","Elektronischer Schlüssel Leser","Čtečka elektronického klíče","iButton lezer 1-Wire","not translated yet","not translated yet","not translated yet","not translated yet","not translated yet","not translated yet","not translated yet",null,null,null,null,null,9.08,8,13,9.08,9.08,230.58,9.08,11.44,9.08,9.08,"Not done","Not done","Not done","Not done","Not done","Not done","Not done"]
[200064.0,"Elektronischer Schlüssel",3.4,null,null,200064.0,"iButton Electronic Key Fob",3.0,null,null,200064.0,"iButton Electronic Key Fob",5.0,null,null,200064.0,"Clé iButton",3.4,null,null,200064.0,"Llave electrónica iButton",3.4,null,null,200064.0,"Elektronický klíč",81.82,null,null,200064.0,"Chiave elettronica",3.4,null,null,200064.0,"Elektronischer Schlüssel",4.86,null,null,200064.0,"Elektronický klíč",3.4,null,null,200064.0,"iButton Electronische sleutel",3.4,null,null,"Not done","not translated yet","Not done",null,null,"Not done","not translated yet","Not done",null,"Not done","not translated yet","Not done",null,null,"Not done","not translated yet","Not done",null,null,"Not done","not translated yet","Not done",null,null,"Not done","not translated yet","Not done",null,null,"Not done","not translated yet","Not done",null,null,null,null,null,null,null,null,81.0,200064,200064,200064,200064,200064,200064,200064,200064,200064,200064,"Not done","Not done","Not done","Not done","Not done","Not done","Not done",null,null,null,null,"Elektronischer Schlüssel","iButton Electronic Key Fob","iButton Electronic Key Fob","Clé iButton","Llave electrónica iButton","Elektronický klíč","Chiave elettronica","Elektronischer Schlüssel","Elektronický klíč","iButton Electronische sleutel","not translated yet","not translated yet","not translated yet","not translated yet","not translated yet","not translated yet","not translated yet",null,null,null,null,null,3.4,3,5,3.4,3.4,81.82,3.4,4.86,3.4,3.4,"Not done","Not done","Not done","Not done","Not done","Not done","Not done"]
[200067.0,"EnOcean Stellantrieb",139.9,null,null,200067.0,"Enocean Wireless Valve Actuator",122.5,null,null,"not available in this country","not available in this country",0.0,null,null,200067.0,"Tête thermostatique Enocean",139.9,null,null,200067.0,"Válvula para radiadores con pilas EnOcean",139.9,null,null,200067.0,"EnOcean bezdrátová hlavice",3799.0,null,null,200067.0,"Valvola termica EnOcean",139.9,null,null,"not available in this country","not available in this country",0.0,null,null,200067.0,"EnOcean bezdrátová hlavice",139.9,null,null,200067.0,"Enocean Draadloos stelventiel",139.9,null,null,"Not done","not translated yet","Not done",null,null,"Not done","not translated yet","Not done",null,"Not done","not translated yet","Not done",null,null,"Not done","not translated yet","Not done",null,null,"Not done","not translated yet","Not done",null,null,"Not done","not translated yet","Not done",null,null,"Not done","not translated yet","Not done",null,null,null,null,null,null,null,null,82.0,200067,200067,"not available in this country",200067,200067,200067,200067,"not available in this country",200067,200067,"Not done","Not done","Not done","Not done","Not done","Not done","Not done",null,null,null,null,"EnOcean Stellantrieb","Enocean Wireless Valve Actuator","not available in this country","Tête thermostatique Enocean","Válvula para radiadores con pilas EnOcean","EnOcean bezdrátová hlavice","Valvola termica EnOcean","not available in this country","EnOcean bezdrátová hlavice","Enocean Draadloos stelventiel","not translated yet","not translated yet","not translated yet","not translated yet","not translated yet","not translated yet","not translated yet",null,null,null,null,null,139.9,122.5,0,139.9,139.9,3799,139.9,0,139.9,139.9,"Not done","Not done","Not done","Not done","Not done","Not done","Not done"]
[200070.0,"Elektronischer Schlüssel Magn.",8.25,null,null,200070.0,"iButton Electronic Key Fob (Magnetic)",7.5,null,null,"not available in this country","not available in this country",0.0,null,null,200070.0,"Clé iButton magnétique",8.25,null,null,200070.0,"Llave electrónica iButton magnética",8.25,null,null,200070.0,"Elektronický klíč (Magnetický)",205.79,null,null,200070.0,"Chiave elettronica magnetico",8.25,null,null,200070.0,"Elektronischer Schlüssel Magn.",11.07,null,null,200070.0,"Elektronický klíč (Magnetický)",8.25,null,null,200070.0,"iButton Electronische sleutel (Magnetisch)",8.25,null,null,"Not done","not translated yet","Not done",null,null,"Not done","not translated yet","Not done",null,"Not done","not translated yet","Not done",null,null,"Not done","not translated yet","Not done",null,null,"Not done","not translated yet","Not done",null,null,"Not done","not translated yet","Not done",null,null,"Not done","not translated yet","Not done",null,null,null,null,null,null,null,null,83.0,200070,200070,"not available in this country",200070,200070,200070,200070,200070,200070,200070,"Not done","Not done","Not done","Not done","Not done","Not done","Not done",null,null,null,null,"Elektronischer Schlüssel Magn.","iButton Electronic Key Fob (Magnetic)","not available in this country","Clé iButton magnétique","Llave electrónica iButton magnética","Elektronický klíč (Magnetický)","Chiave elettronica magnetico","Elektronischer Schlüssel Magn.","Elektronický klíč (Magnetický)","iButton Electronische sleutel (Magnetisch)","not translated yet","not translated yet","not translated yet","not translated yet","not translated yet","not translated yet","not translated yet",null,null,null,null,null,8.25,7.5,0,8.25,8.25,205.79,8.25,11.07,8.25,8.25,"Not done","Not done","Not done","Not done","Not done","Not done","Not done"]
[200077.0,"1-Wire Hülsen Temperaturfühler",10.9,null,null,200077.0,"Temperature Probe 1-Wire",10.35,null,null,200077.0,"Temperature Probe 1-Wire",15.5,null,null,200077.0,"Sonde de température étanche 1-Wire",10.9,null,null,200077.0,"Sensor de temperatura 1-Wire metálico",10.9,null,null,200077.0,"1-Wire teplotní čip v pouzdře",285.4,null,null,200077.0,"1-Wire sensore di temperatura a manicotto",10.9,null,null,200077.0,"1-Wire Hülsen Temperaturfühler",14.4,null,null,200077.0,"1-Wire teplotní čip v pouzdře",10.9,null,null,200077.0,"Temperatuurvoeler 1-Wire",10.9,null,null,"Not done","not translated yet","Not done",null,null,"Not done","not translated yet","Not done",null,"Not done","not translated yet","Not done",null,null,"Not done","not translated yet","Not done",null,null,"Not done","not translated yet","Not done",null,null,"Not done","not translated yet","Not done",null,null,"Not done","not translated yet","Not done",null,null,null,null,null,null,null,null,84.0,200077,200077,200077,200077,200077,200077,200077,200077,200077,200077,"Not done","Not done","Not done","Not done","Not done","Not done","Not done",null,null,null,null,"1-Wire Hülsen Temperaturfühler","Temperature Probe 1-Wire","Temperature Probe 1-Wire","Sonde de température étanche 1-Wire","Sensor de temperatura 1-Wire metálico","1-Wire teplotní čip v pouzdře","1-Wire sensore di temperatura a manicotto","1-Wire Hülsen Temperaturfühler","1-Wire teplotní čip v pouzdře","Temperatuurvoeler 1-Wire","not translated yet","not translated yet","not translated yet","not translated yet","not translated yet","not translated yet","not translated yet",null,null,null,null,null,10.9,10.35,15.5,10.9,10.9,285.4,10.9,14.4,10.9,10.9,"Not done","Not done","Not done","Not done","Not done","Not done","Not done"]
[200086.0,"Fanshirt S",12.49,null,null,200086.0,"Fanshirt S",10.75,null,null,200086.0,"Fanshirt S",19.0,null,null,200086.0,"Fanshirt S",12.49,null,null,200086.0,"Camiseta Fan S",12.49,null,null,200086.0,"Loxone Fanshirt S",285.4,null,null,200086.0,"Fanshirt S",12.49,null,null,200086.0,"Fanshirt S",16.62,null,null,200086.0,"Loxone Fanshirt S",12.49,null,null,200086.0,"Fanshirt S",12.49,null,null,"Not done","not translated yet","Not done",null,null,"Not done","not translated yet","Not done",null,"Not done","not translated yet","Not done",null,null,"Not done","not translated yet","Not done",null,null,"Not done","not translated yet","Not done",null,null,"Not done","not translated yet","Not done",null,null,"Not done","not translated yet","Not done",null,null,null,null,null,null,null,null,85.0,200086,200086,200086,200086,200086,200086,200086,200086,200086,200086,"Not done","Not done","Not done","Not done","Not done","Not done","Not done",null,null,null,null,"Fanshirt S","Fanshirt S","Fanshirt S","Fanshirt S","Camiseta Fan S","Loxone Fanshirt S","Fanshirt S","Fanshirt S","Loxone Fanshirt S","Fanshirt S","not translated yet","not translated yet","not translated yet","not translated yet","not translated yet","not translated yet","not translated yet",null,null,null,null,null,12.49,10.75,19,12.49,12.49,285.4,12.49,16.62,12.49,12.49,"Not done","Not done","Not done","Not done","Not done","Not done","Not done"]
[200087.0,"Fanshirt M",12.49,null,null,200087.0,"Fanshirt M",10.75,null,null,200087.0,"Fanshirt M",19.0,null,null,200087.0,"Fanshirt M",12.49,null,null,200087.0,"Camiseta Fan M",12.49,null,null,200087.0,"Loxone Fanshirt M",319.0,null,null,200087.0,"Fanshirt M",12.49,null,null,200087.0,"Fanshirt M",16.62,null,null,200087.0,"Loxone Fanshirt M",12.49,null,null,200087.0,"Fanshirt M",12.49,null,null,"Not done","not translated yet","Not done",null,null,"Not done","not translated yet","Not done",null,"Not done","not translated yet","Not done",null,null,"Not done","not translated yet","Not done",null,null,"Not done","not translated yet","Not done",null,null,"Not done","not translated yet","Not done",null,null,"Not done","not translated yet","Not done",null,null,null,null,null,null,null,null,86.0,200087,200087,200087,200087,200087,200087,200087,200087,200087,200087,"Not done","Not done","Not done","Not done","Not done","Not done","Not done",null,null,null,null,"Fanshirt M","Fanshirt M","Fanshirt M","Fanshirt M","Camiseta Fan M","Loxone Fanshirt M","Fanshirt M","Fanshirt M","Loxone Fanshirt M","Fanshirt M","not translated yet","not translated yet","not translated yet","not translated yet","not translated yet","not translated yet","not translated yet",null,null,null,null,null,12.49,10.75,19,12.49,12.49,319,12.49,16.62,12.49,12.49,"Not done","Not done","Not done","Not done","Not done","Not done","Not done"]
[200088.0,"Fanshirt L",12.49,null,null,200088.0,"Fanshirt L",10.75,null,null,200088.0,"Fanshirt L",19.0,null,null,200088.0,"Fanshirt L",12.49,null,null,200088.0,"Camiseta Fan L",12.49,null,null,200088.0,"Loxone Fanshirt L",319.0,null,null,200088.0,"Fanshirt L",12.49,null,null,200088.0,"Fanshirt L",16.62,null,null,200088.0,"Loxone Fanshirt L",12.49,null,null,200088.0,"Fanshirt L",12.49,null,null,"Not done","not translated yet","Not done",null,null,"Not done","not translated yet","Not done",null,"Not done","not translated yet","Not done",null,null,"Not done","not translated yet","Not done",null,null,"Not done","not translated yet","Not done",null,null,"Not done","not translated yet","Not done",null,null,"Not done","not translated yet","Not done",null,null,null,null,null,null,null,null,87.0,200088,200088,200088,200088,200088,200088,200088,200088,200088,200088,"Not done","Not done","Not done","Not done","Not done","Not done","Not done",null,null,null,null,"Fanshirt L","Fanshirt L","Fanshirt L","Fanshirt L","Camiseta Fan L","Loxone Fanshirt L","Fanshirt L","Fanshirt L","Loxone Fanshirt L","Fanshirt L","not translated yet","not translated yet","not translated yet","not translated yet","not translated yet","not translated yet","not translated yet",null,null,null,null,null,12.49,10.75,19,12.49,12.49,319,12.49,16.62,12.49,12.49,"Not done","Not done","Not done","Not done","Not done","Not done","Not done"]
[200089.0,"Fanshirt XL",12.49,null,null,200089.0,"Fanshirt XL",10.75,null,null,200089.0,"Fanshirt XL",19.0,null,null,200089.0,"Fanshirt XL",12.49,null,null,200089.0,"Camiseta Fan XL",12.49,null,null,200089.0,"Loxone Fanshirt XL",319.0,null,null,200089.0,"Fanshirt XL",12.49,null,null,200089.0,"Fanshirt XL",16.62,null,null,200089.0,"Loxone Fanshirt XL",12.49,null,null,200089.0,"Fanshirt XL",12.49,null,null,"Not done","not translated yet","Not done",null,null,"Not done","not translated yet","Not done",null,"Not done","not translated yet","Not done",null,null,"Not done","not translated yet","Not done",null,null,"Not done","not translated yet","Not done",null,null,"Not done","not translated yet","Not done",null,null,"Not done","not translated yet","Not done",null,null,null,null,null,null,null,null,88.0,200089,200089,200089,200089,200089,200089,200089,200089,200089,200089,"Not done","Not done","Not done","Not done","Not done","Not done","Not done",null,null,null,null,"Fanshirt XL","Fanshirt XL","Fanshirt XL","Fanshirt XL","Camiseta Fan XL","Loxone Fanshirt XL","Fanshirt XL","Fanshirt XL","Loxone Fanshirt XL","Fanshirt XL","not translated yet","not translated yet","not translated yet","not translated yet","not translated yet","not translated yet","not translated yet",null,null,null,null,null,12.49,10.75,19,12.49,12.49,319,12.49,16.62,12.49,12.49,"Not done","Not done","Not done","Not done","Not done","Not done","Not done"]
[200090.0,"Fanshirt XXL",12.49,null,null,200090.0,"Fanshirt XXL",10.75,null,null,200090.0,"Fanshirt XXL",19.0,null,null,200090.0,"Fanshirt XXL",12.49,null,null,200090.0,"Camiseta Fan XXL",12.49,null,null,200090.0,"Loxone Fanshirt XXL",319.0,null,null,200090.0,"Fanshirt XXL",12.49,null,null,200090.0,"Fanshirt XXL",16.62,null,null,200090.0,"Loxone Fanshirt XXL",12.49,null,null,200090.0,"Fanshirt XXL",12.49,null,null,"Not done","not translated yet","Not done",null,null,"Not done","not translated yet","Not done",null,"Not done","not translated yet","Not done",null,null,"Not done","not translated yet","Not done",null,null,"Not done","not translated yet","Not done",null,null,"Not done","not translated yet","Not done",null,null,"Not done","not translated yet","Not done",null,null,null,null,null,null,null,null,89.0,200090,200090,200090,200090,200090,200090,200090,200090,200090,200090,"Not done","Not done","Not done","Not done","Not done","Not done","Not done",null,null,null,null,"Fanshirt XXL","Fanshirt XXL","Fanshirt XXL","Fanshirt XXL","Camiseta Fan XXL","Loxone Fanshirt XXL","Fanshirt XXL","Fanshirt XXL","Loxone Fanshirt XXL","Fanshirt XXL","not translated yet","not translated yet","not translated yet","not translated yet","not translated yet","not translated yet","not translated yet",null,null,null,null,null,12.49,10.75,19,12.49,12.49,319,12.49,16.62,12.49,12.49,"Not done","Not done","Not done","Not done","Not done","Not done","Not done"]
[200092.0,"LED Str. WW 5m IP68",89.9,null,null,200092.0,"Warm White LED Strip 5m IP68",77.5,null,null,200092.0,"Warm White LED Strip 5m IP68",115.0,null,null,200092.0,"Ruban blanc chaud 5m IP68",89.9,null,null,200092.0,"Tira LED blanco cálido 5m IP68",89.9,null,null,200092.0,"5m LED pásky (teplá bílá) - IP68 (proti potopení do vody)",2499.0,null,null,200092.0,"Strisce LED WW 5m IP68",89.9,null,null,200092.0,"LED Str. WW 5m IP68",119.44,null,null,200092.0,"5m LED pásky (teplá bílá) - IP68 (proti potopení do vody)",89.9,null,null,200092.0,"Warm Wit LED Strip 5m IP68",89.9,null,null,"Not done","not translated yet","Not done",null,null,"Not done","not translated yet","Not done",null,"Not done","not translated yet","Not done",null,null,"Not done","not translated yet","Not done",null,null,"Not done","not translated yet","Not done",null,null,"Not done","not translated yet","Not done",null,null,"Not done","not translated yet","Not done",null,null,null,null,null,null,null,null,90.0,200092,200092,200092,200092,200092,200092,200092,200092,200092,200092,"Not done","Not done","Not done","Not done","Not done","Not done","Not done",null,null,null,null,"LED Str. WW 5m IP68","Warm White LED Strip 5m IP68","Warm White LED Strip 5m IP68","Ruban blanc chaud 5m IP68","Tira LED blanco cálido 5m IP68","5m LED pásky (teplá bílá) - IP68 (proti potopení do vody)","Strisce LED WW 5m IP68","LED Str. WW 5m IP68","5m LED pásky (teplá bílá) - IP68 (proti potopení do vody)","Warm Wit LED Strip 5m IP68","not translated yet","not translated yet","not translated yet","not translated yet","not translated yet","not translated yet","not translated yet",null,null,null,null,null,89.9,77.5,115,89.9,89.9,2499,89.9,119.44,89.9,89.9,"Not done","Not done","Not done","Not done","Not done","Not done","Not done"]
[200093.0,"Loxone Intercom",840.33,null,null,200103.0,"Loxone Intercom",722.5,null,null,200103.0,"Loxone Intercom",1149.0,null,null,200103.0,"Loxone Intercom",840.33,null,null,200093.0,"Loxone Intercom",840.33,null,null,200093.0,"Loxone Intercom",24999.0,null,null,200093.0,"Loxone Intercom",840.33,null,null,200093.0,"Loxone Intercom",897.22,null,null,200093.0,"Loxone Intercom",840.33,null,null,200093.0,"Loxone Intercom",840.33,null,null,"Not done","not translated yet","Not done",null,null,"Not done","not translated yet","Not done",null,"Not done","not translated yet","Not done",null,null,"Not done","not translated yet","Not done",null,null,"Not done","not translated yet","Not done",null,null,"Not done","not translated yet","Not done",null,null,"Not done","not translated yet","Not done",null,null,null,null,null,null,null,null,91.0,200093,200103,200103,200103,200093,200093,200093,200093,200093,200093,"Not done","Not done","Not done","Not done","Not done","Not done","Not done",null,null,null,null,"Loxone Intercom","Loxone Intercom","Loxone Intercom","Loxone Intercom","Loxone Intercom","Loxone Intercom","Loxone Intercom","Loxone Intercom","Loxone Intercom","Loxone Intercom","not translated yet","not translated yet","not translated yet","not translated yet","not translated yet","not translated yet","not translated yet",null,null,null,null,null,840.33,722.5,1149,840.33,840.33,24999,840.33,897.22,840.33,840.33,"Not done","Not done","Not done","Not done","Not done","Not done","Not done"]
[200094.0,"Intercom Unterputz-Box",55.0,null,null,200094.0,"Flush-mounted box for the Loxone intercom",47.5,null,null,200094.0,"Flush-mounted box for the Loxone intercom",70.0,null,null,200094.0,"Boitier d'encastrement Intercom",55.0,null,null,200094.0,"Caja para montaje empotrado Loxone Intercom",55.0,null,null,200094.0,"Zapuštěný box pro Loxone Intercom",1375.0,null,null,200094.0,"Intercom box montaggio a livello",55.0,null,null,200094.0,"Intercom Unterputz-Box",70.32,null,null,200094.0,"Zapuštěný box pro Loxone Intercom",55.0,null,null,200094.0,"Inbouwbehuizing voor Loxone intercom",55.0,null,null,"Not done","not translated yet","Not done",null,null,"Not done","not translated yet","Not done",null,"Not done","not translated yet","Not done",null,null,"Not done","not translated yet","Not done",null,null,"Not done","not translated yet","Not done",null,null,"Not done","not translated yet","Not done",null,null,"Not done","not translated yet","Not done",null,null,null,null,null,null,null,null,92.0,200094,200094,200094,200094,200094,200094,200094,200094,200094,200094,"Not done","Not done","Not done","Not done","Not done","Not done","Not done",null,null,null,null,"Intercom Unterputz-Box","Flush-mounted box for the Loxone intercom","Flush-mounted box for the Loxone intercom","Boitier d'encastrement Intercom","Caja para montaje empotrado Loxone Intercom","Zapuštěný box pro Loxone Intercom","Intercom box montaggio a livello","Intercom Unterputz-Box","Zapuštěný box pro Loxone Intercom","Inbouwbehuizing voor Loxone intercom","not translated yet","not translated yet","not translated yet","not translated yet","not translated yet","not translated yet","not translated yet",null,null,null,null,null,55,47.5,70,55,55,1375,55,70.32,55,55,"Not done","Not done","Not done","Not done","Not done","Not done","Not done"]
[200095.0,"Intercom Aufputz-Box",100.0,null,null,200095.0,"Surface Box for Loxone Intercom",87.5,null,null,200095.0,"Surface Box for Loxone Intercom",130.0,null,null,200095.0,"Boitier applique Intercom",100.0,null,null,200095.0,"Caja para montaje en superficie Loxone Intercom",100.0,null,null,200095.0,"Povrchový box pro Loxone Intercom",2499.0,null,null,200095.0,"Intercom box montaggio sporgente",100.0,null,null,200095.0,"Intercom Aufputz-Box",128.7,null,null,200095.0,"Povrchový box pro Loxone Intercom",100.0,null,null,200095.0,"Opbouwbehuizing voor Loxone Intercom",100.0,null,null,"Not done","not translated yet","Not done",null,null,"Not done","not translated yet","Not done",null,"Not done","not translated yet","Not done",null,null,"Not done","not translated yet","Not done",null,null,"Not done","not translated yet","Not done",null,null,"Not done","not translated yet","Not done",null,null,"Not done","not translated yet","Not done",null,null,null,null,null,null,null,null,93.0,200095,200095,200095,200095,200095,200095,200095,200095,200095,200095,"Not done","Not done","Not done","Not done","Not done","Not done","Not done",null,null,null,null,"Intercom Aufputz-Box","Surface Box for Loxone Intercom","Surface Box for Loxone Intercom","Boitier applique Intercom","Caja para montaje en superficie Loxone Intercom","Povrchový box pro Loxone Intercom","Intercom box montaggio sporgente","Intercom Aufputz-Box","Povrchový box pro Loxone Intercom","Opbouwbehuizing voor Loxone Intercom","not translated yet","not translated yet","not translated yet","not translated yet","not translated yet","not translated yet","not translated yet",null,null,null,null,null,100,87.5,130,100,100,2499,100,128.7,100,100,"Not done","Not done","Not done","Not done","Not done","Not done","Not done"]
[200097.0,"Loxone Speaker",89.0,null,null,200097.0,"Loxone Speaker",77.5,null,null,200097.0,"Loxone Speaker",117.0,null,null,200097.0,"Loxone Speaker",89.0,null,null,200097.0,"Loxone Speaker",89.0,null,null,200097.0,"Loxone Speaker",2225.0,null,null,200097.0,"Loxone Speaker",89.0,null,null,200097.0,"Loxone Speaker",110.19,null,null,200097.0,"Loxone Speaker",89.0,null,null,200097.0,"Loxone Speaker",89.0,null,null,"Not done","not translated yet","Not done",null,null,"Not done","not translated yet","Not done",null,"Not done","not translated yet","Not done",null,null,"Not done","not translated yet","Not done",null,null,"Not done","not translated yet","Not done",null,null,"Not done","not translated yet","Not done",null,null,"Not done","not translated yet","Not done",null,null,null,null,null,null,null,null,94.0,200097,200097,200097,200097,200097,200097,200097,200097,200097,200097,"Not done","Not done","Not done","Not done","Not done","Not done","Not done",null,null,null,null,"Loxone Speaker","Loxone Speaker","Loxone Speaker","Loxone Speaker","Loxone Speaker","Loxone Speaker","Loxone Speaker","Loxone Speaker","Loxone Speaker","Loxone Speaker","not translated yet","not translated yet","not translated yet","not translated yet","not translated yet","not translated yet","not translated yet",null,null,null,null,null,89,77.5,117,89,89,2225,89,110.19,89,89,"Not done","Not done","Not done","Not done","Not done","Not done","Not done"]
[200098.0,"RGBW LED Streifen 5 m IP20",109.9,null,null,200098.0,"RGBW LED Strip 5m IP20",97.5,null,null,200098.0,"RGBW LED Strip 5m IP20",149.0,null,null,200098.0,"Ruban Led RGBW 5m IP20",109.9,null,null,200098.0,"Tira LED RGBW 5 m IP20",109.9,null,null,200098.0,"5m RGBW LED pásky IP20 (bez ochrany proti vodě)",2999.0,null,null,200098.0,"Strisce RGBW LED 5 m IP20",109.9,null,null,200098.0,"RGBW LED Streifen 5 m IP20",128.7,null,null,200098.0,"5m RGBW LED pásky IP20 (bez ochrany proti vodě)",109.9,null,null,200098.0,"RGBW LED Strip 5m IP20",109.9,null,null,"Not done","not translated yet","Not done",null,null,"Not done","not translated yet","Not done",null,"Not done","not translated yet","Not done",null,null,"Not done","not translated yet","Not done",null,null,"Not done","not translated yet","Not done",null,null,"Not done","not translated yet","Not done",null,null,"Not done","not translated yet","Not done",null,null,null,null,null,null,null,null,95.0,200098,200098,200098,200098,200098,200098,200098,200098,200098,200098,"Not done","Not done","Not done","Not done","Not done","Not done","Not done",null,null,null,null,"RGBW LED Streifen 5 m IP20","RGBW LED Strip 5m IP20","RGBW LED Strip 5m IP20","Ruban Led RGBW 5m IP20","Tira LED RGBW 5 m IP20","5m RGBW LED pásky IP20 (bez ochrany proti vodě)","Strisce RGBW LED 5 m IP20","RGBW LED Streifen 5 m IP20","5m RGBW LED pásky IP20 (bez ochrany proti vodě)","RGBW LED Strip 5m IP20","not translated yet","not translated yet","not translated yet","not translated yet","not translated yet","not translated yet","not translated yet",null,null,null,null,null,109.9,97.5,149,109.9,109.9,2999,109.9,128.7,109.9,109.9,"Not done","Not done","Not done","Not done","Not done","Not done","Not done"]
[200099.0,"RGBW LED Streifen 5 m IP65",114.9,null,null,200099.0,"RGBW LED Strip 5m IP65",100.0,null,null,200099.0,"RGBW LED Strip 5m IP65",156.0,null,null,200099.0,"Ruban Led RGBW 5m IP65",114.9,null,null,200099.0,"Tira LED RGBW 5 m IP65",114.9,null,null,200099.0,"5m RGBW LED pásky IP65 (proti tryskající vodě)",3099.0,null,null,200099.0,"Strisce RGBW LED 5 m IP65",114.9,null,null,200099.0,"RGBW LED Streifen 5 m IP65",137.96,null,null,200099.0,"5m RGBW LED pásky IP65 (proti tryskající vodě)",114.9,null,null,200099.0,"RGBW LED Strip 5m IP65",114.9,null,null,"Not done","not translated yet","Not done",null,null,"Not done","not translated yet","Not done",null,"Not done","not translated yet","Not done",null,null,"Not done","not translated yet","Not done",null,null,"Not done","not translated yet","Not done",null,null,"Not done","not translated yet","Not done",null,null,"Not done","not translated yet","Not done",null,null,null,null,null,null,null,null,96.0,200099,200099,200099,200099,200099,200099,200099,200099,200099,200099,"Not done","Not done","Not done","Not done","Not done","Not done","Not done",null,null,null,null,"RGBW LED Streifen 5 m IP65","RGBW LED Strip 5m IP65","RGBW LED Strip 5m IP65","Ruban Led RGBW 5m IP65","Tira LED RGBW 5 m IP65","5m RGBW LED pásky IP65 (proti tryskající vodě)","Strisce RGBW LED 5 m IP65","RGBW LED Streifen 5 m IP65","5m RGBW LED pásky IP65 (proti tryskající vodě)","RGBW LED Strip 5m IP65","not translated yet","not translated yet","not translated yet","not translated yet","not translated yet","not translated yet","not translated yet",null,null,null,null,null,114.9,100,156,114.9,114.9,3099,114.9,137.96,114.9,114.9,"Not done","Not done","Not done","Not done","Not done","Not done","Not done"]
[200100.0,"RGBW LED Streifen 5 m IP68",119.9,null,null,200100.0,"RGBW LED Strip 5m IP68",102.5,null,null,200100.0,"RGBW LED Strip 5m IP68",164.0,null,null,200100.0,"Ruban Led RGBW 5m IP68",119.9,null,null,200100.0,"Tira LED RGBW 5 m IP68",119.9,null,null,200100.0,"5m RGBW LED pásky IP68 (proti potopení do vody)",3249.0,null,null,200100.0,"Strisce RGBW LED 5 m IP68",119.9,null,null,200100.0,"RGBW LED Streifen 5 m IP68",147.22,null,null,200100.0,"5m RGBW LED pásky IP68 (proti potopení do vody)",119.9,null,null,200100.0,"RGBW LED Strip 5m IP68",119.9,null,null,"Not done","not translated yet","Not done",null,null,"Not done","not translated yet","Not done",null,"Not done","not translated yet","Not done",null,null,"Not done","not translated yet","Not done",null,null,"Not done","not translated yet","Not done",null,null,"Not done","not translated yet","Not done",null,null,"Not done","not translated yet","Not done",null,null,null,null,null,null,null,null,97.0,200100,200100,200100,200100,200100,200100,200100,200100,200100,200100,"Not done","Not done","Not done","Not done","Not done","Not done","Not done",null,null,null,null,"RGBW LED Streifen 5 m IP68","RGBW LED Strip 5m IP68","RGBW LED Strip 5m IP68","Ruban Led RGBW 5m IP68","Tira LED RGBW 5 m IP68","5m RGBW LED pásky IP68 (proti potopení do vody)","Strisce RGBW LED 5 m IP68","RGBW LED Streifen 5 m IP68","5m RGBW LED pásky IP68 (proti potopení do vody)","RGBW LED Strip 5m IP68","not translated yet","not translated yet","not translated yet","not translated yet","not translated yet","not translated yet","not translated yet",null,null,null,null,null,119.9,102.5,164,119.9,119.9,3249,119.9,147.22,119.9,119.9,"Not done","Not done","Not done","Not done","Not done","Not done","Not done"]
[200101.0,"Wasser Sensor",17.0,null,null,200101.0,"Water Sensor",15.0,null,null,200101.0,"Water Sensor",23.0,null,null,200101.0,"Capteur d'inondation",17.0,null,null,200101.0,"Sensor de inundación",17.0,null,null,200101.0,"Záplavový senzor",425.0,null,null,200101.0,"Sensore acqua",17.0,null,null,200101.0,"Wasser Sensor",24.95,null,null,200101.0,"Záplavový senzor",17.0,null,null,200101.0,"Water Sensor",17.0,null,null,"Not done","not translated yet","Not done",null,null,"Not done","not translated yet","Not done",null,"Not done","not translated yet","Not done",null,null,"Not done","not translated yet","Not done",null,null,"Not done","not translated yet","Not done",null,null,"Not done","not translated yet","Not done",null,null,"Not done","not translated yet","Not done",null,null,null,null,null,null,null,null,98.0,200101,200101,200101,200101,200101,200101,200101,200101,200101,200101,"Not done","Not done","Not done","Not done","Not done","Not done","Not done",null,null,null,null,"Wasser Sensor","Water Sensor","Water Sensor","Capteur d'inondation","Sensor de inundación","Záplavový senzor","Sensore acqua","Wasser Sensor","Záplavový senzor","Water Sensor","not translated yet","not translated yet","not translated yet","not translated yet","not translated yet","not translated yet","not translated yet",null,null,null,null,null,17,15,23,17,17,425,17,24.95,17,17,"Not done","Not done","Not done","Not done","Not done","Not done","Not done"]
[200107.0,"Kaltgerätekabel 1,2m",3.0,null,null,"NA","not available in this country",0.0,null,null,"not available in this country","not available in this country",0.0,null,null,"not available in this country","not available in this country",null,null,null,200107.0,"Cable alimentación 1,2m",3.0,null,null,"not available in this country","not available in this country",0.0,null,null,200107.0,"Cavo di allacciamento 1,2m",3.0,null,null,"not available in this country","not available in this country",0.0,null,null,"not available in this country","not available in this country",0.0,null,null,200107.0,"Netsnoer 1,2m",3.0,null,null,"Not done","not translated yet","Not done",null,null,"Not done","not translated yet","Not done",null,"Not done","not translated yet","Not done",null,null,"Not done","not translated yet","Not done",null,null,"Not done","not translated yet","Not done",null,null,"Not done","not translated yet","Not done",null,null,"Not done","not translated yet","Not done",null,null,null,null,null,null,null,null,99.0,200107,"NA","not available in this country","not available in this country",200107,"not available in this country",200107,"not available in this country","not available in this country",200107,"Not done","Not done","Not done","Not done","Not done","Not done","Not done",null,null,null,null,"Kaltgerätekabel 1,2m","not available in this country","not available in this country","not available in this country","Cable alimentación 1,2m","not available in this country","Cavo di allacciamento 1,2m","not available in this country","not available in this country","Netsnoer 1,2m","not translated yet","not translated yet","not translated yet","not translated yet","not translated yet","not translated yet","not translated yet",null,null,null,null,null,3,0,0,"",3,0,3,0,0,3,"Not done","Not done","Not done","Not done","Not done","Not done","Not done"]
[200109.0,"1-wire Temperaturfühler Set",39.9,null,null,200109.0,"Temperature Sensor Set 1-Wire",35.0,null,null,200109.0,"Temperature Sensor Set 1-Wire",53.9,null,null,200109.0,"Kit de sondes de tempréature 1-Wire",39.9,null,null,200109.0,"Set 5 sensores de Temperatura 1-Wire",39.9,null,null,200109.0,"1-Wire teplotní senzor set",1049.0,null,null,200109.0,"1-wire sensore temperatura set",39.9,null,null,200109.0,"1-wire Temperaturfühler Set",49.03,null,null,200109.0,"1-Wire teplotní senzor set",39.9,null,null,200109.0,"Temperatuur Sensor Set 1-Wire",39.9,null,null,"Not done","not translated yet","Not done",null,null,"Not done","not translated yet","Not done",null,"Not done","not translated yet","Not done",null,null,"Not done","not translated yet","Not done",null,null,"Not done","not translated yet","Not done",null,null,"Not done","not translated yet","Not done",null,null,"Not done","not translated yet","Not done",null,null,null,null,null,null,null,null,100.0,200109,200109,200109,200109,200109,200109,200109,200109,200109,200109,"Not done","Not done","Not done","Not done","Not done","Not done","Not done",null,null,null,null,"1-wire Temperaturfühler Set","Temperature Sensor Set 1-Wire","Temperature Sensor Set 1-Wire","Kit de sondes de tempréature 1-Wire","Set 5 sensores de Temperatura 1-Wire","1-Wire teplotní senzor set","1-wire sensore temperatura set","1-wire Temperaturfühler Set","1-Wire teplotní senzor set","Temperatuur Sensor Set 1-Wire","not translated yet","not translated yet","not translated yet","not translated yet","not translated yet","not translated yet","not translated yet",null,null,null,null,null,39.9,35,53.9,39.9,39.9,1049,39.9,49.03,39.9,39.9,"Not done","Not done","Not done","Not done","Not done","Not done","Not done"]
[200110.0,"Loxone 12-Kanal Verstärker",599.0,null,null,200110.0,"Loxone 12 Channel Amplifier",515.0,null,null,200110.0,"Loxone 12 Channel Amplifier",999.0,null,null,200110.0,"Amplificateur 12 canaux",599.0,null,null,200110.0,"Amplificador Loxone 12-Canales",599.0,null,null,200110.0,"Loxone 12ti kanálový zesilovač",15999.0,null,null,200110.0,"Loxone amplificatore 12 canali",599.0,null,null,200110.0,"Loxone 12-Kanal Verstärker",739.82,null,null,200110.0,"Loxone 12ti kanálový zesilovač",599.0,null,null,200110.0,"Loxone 12 Kanaal Versterker",599.0,null,null,"Not done","not translated yet","Not done",null,null,"Not done","not translated yet","Not done",null,"Not done","not translated yet","Not done",null,null,"Not done","not translated yet","Not done",null,null,"Not done","not translated yet","Not done",null,null,"Not done","not translated yet","Not done",null,null,"Not done","not translated yet","Not done",null,null,null,null,null,null,null,null,101.0,200110,200110,200110,200110,200110,200110,200110,200110,200110,200110,"Not done","Not done","Not done","Not done","Not done","Not done","Not done",null,null,null,null,"Loxone 12-Kanal Verstärker","Loxone 12 Channel Amplifier","Loxone 12 Channel Amplifier","Amplificateur 12 canaux","Amplificador Loxone 12-Canales","Loxone 12ti kanálový zesilovač","Loxone amplificatore 12 canali","Loxone 12-Kanal Verstärker","Loxone 12ti kanálový zesilovač","Loxone 12 Kanaal Versterker","not translated yet","not translated yet","not translated yet","not translated yet","not translated yet","not translated yet","not translated yet",null,null,null,null,null,599,515,999,599,599,15999,599,739.82,599,599,"Not done","Not done","Not done","Not done","Not done","Not done","Not done"]
[200112.0,"Bewegungsmelder 24V (Aussenbereich)",99.6,null,null,200112.0,"Outside Motion Sensor (24V)",87.5,null,null,200112.0,"Outside Motion Sensor (24V)",135.0,null,null,200112.0,"Détecteur de présence extérieur (24V)",99.6,null,null,200112.0,"Detector de presencia para exterior 24V",99.6,null,null,200112.0,"Senzor pohybu 24V (venkovní)",2499.0,null,null,200112.0,"Sensore movimento 24V",99.6,null,null,200112.0,"Bewegungsmelder 24V (Aussenbereich)",119.44,null,null,200112.0,"Senzor pohybu 24V (venkovní)",99.6,null,null,200112.0,"Buitenbewegingsmelder (24V)",99.6,null,null,"Not done","not translated yet","Not done",null,null,"Not done","not translated yet","Not done",null,"Not done","not translated yet","Not done",null,null,"Not done","not translated yet","Not done",null,null,"Not done","not translated yet","Not done",null,null,"Not done","not translated yet","Not done",null,null,"Not done","not translated yet","Not done",null,null,null,null,null,null,null,null,102.0,200112,200112,200112,200112,200112,200112,200112,200112,200112,200112,"Not done","Not done","Not done","Not done","Not done","Not done","Not done",null,null,null,null,"Bewegungsmelder 24V (Aussenbereich)","Outside Motion Sensor (24V)","Outside Motion Sensor (24V)","Détecteur de présence extérieur (24V)","Detector de presencia para exterior 24V","Senzor pohybu 24V (venkovní)","Sensore movimento 24V","Bewegungsmelder 24V (Aussenbereich)","Senzor pohybu 24V (venkovní)","Buitenbewegingsmelder (24V)","not translated yet","not translated yet","not translated yet","not translated yet","not translated yet","not translated yet","not translated yet",null,null,null,null,null,99.6,87.5,135,99.6,99.6,2499,99.6,119.44,99.6,99.6,"Not done","Not done","Not done","Not done","Not done","Not done","Not done"]
[200113.0,"Fensterkontakt Loxone",9.9,null,null,200113.0,"Window & Door Contact",8.5,null,null,200113.0,"Window & Door Contact",13.5,null,null,200113.0,"Contact d'ouverture porte / fenêtre",9.9,null,null,200113.0,"Contacto de ventana Loxone",9.9,null,null,200113.0,"Okenní kontakt",259.0,null,null,200113.0,"Contatto finestra Loxone",9.9,null,null,200113.0,"Fensterkontakt Loxone",12.27,null,null,200113.0,"Okenní kontakt",9.9,null,null,200113.0,"Raam- /Deurcontact",9.9,null,null,"Not done","not translated yet","Not done",null,null,"Not done","not translated yet","Not done",null,"Not done","not translated yet","Not done",null,null,"Not done","not translated yet","Not done",null,null,"Not done","not translated yet","Not done",null,null,"Not done","not translated yet","Not done",null,null,"Not done","not translated yet","Not done",null,null,null,null,null,null,null,null,103.0,200113,200113,200113,200113,200113,200113,200113,200113,200113,200113,"Not done","Not done","Not done","Not done","Not done","Not done","Not done",null,null,null,null,"Fensterkontakt Loxone","Window & Door Contact","Window & Door Contact","Contact d'ouverture porte / fenêtre","Contacto de ventana Loxone","Okenní kontakt","Contatto finestra Loxone","Fensterkontakt Loxone","Okenní kontakt","Raam- /Deurcontact","not translated yet","not translated yet","not translated yet","not translated yet","not translated yet","not translated yet","not translated yet",null,null,null,null,null,9.9,8.5,13.5,9.9,9.9,259,9.9,12.27,9.9,9.9,"Not done","Not done","Not done","Not done","Not done","Not done","Not done"]
[200129.0,"Loxone CAT7 Kabel (250 m)",172.5,null,null,200129.0,"Loxone Cat 7 Cable",147.5,null,null,200129.0,"Loxone Cat 7 Cable (820ft)",265.0,null,null,200129.0,"Câble Cat 7",172.5,null,null,200129.0,"Cable CAT7 Loxone (250 m)",172.5,null,null,200129.0,"Loxone Cat 7 kabel",4699.0,null,null,200129.0,"Loxone cavo CAT7 (250 m)",172.5,null,null,200129.0,"Loxone CAT7 Kabel (250 m)",212.04,null,null,200129.0,"Loxone Cat 7 kabel",172.5,null,null,200129.0,"Loxone Cat 7 Kabel",172.5,null,null,"Not done","not translated yet","Not done",null,null,"Not done","not translated yet","Not done",null,"Not done","not translated yet","Not done",null,null,"Not done","not translated yet","Not done",null,null,"Not done","not translated yet","Not done",null,null,"Not done","not translated yet","Not done",null,null,"Not done","not translated yet","Not done",null,null,null,null,null,null,null,null,104.0,200129,200129,200129,200129,200129,200129,200129,200129,200129,200129,"Not done","Not done","Not done","Not done","Not done","Not done","Not done",null,null,null,null,"Loxone CAT7 Kabel (250 m)","Loxone Cat 7 Cable","Loxone Cat 7 Cable (820ft)","Câble Cat 7","Cable CAT7 Loxone (250 m)","Loxone Cat 7 kabel","Loxone cavo CAT7 (250 m)","Loxone CAT7 Kabel (250 m)","Loxone Cat 7 kabel","Loxone Cat 7 Kabel","not translated yet","not translated yet","not translated yet","not translated yet","not translated yet","not translated yet","not translated yet",null,null,null,null,null,172.5,147.5,265,172.5,172.5,4699,172.5,212.04,172.5,172.5,"Not done","Not done","Not done","Not done","Not done","Not done","Not done"]
[200135.0,"EnOcean Bewegungsmelder",109.9,null,null,200135.0,"Enocean Motion Sensor",95.0,null,null,"not available in this country","not available in this country",0.0,null,null,200135.0,"Détecteur de présence EnOcean",109.9,null,null,200135.0,"Detector de presencia inalámbrico EnOcean",109.9,null,null,200135.0,"Enocean Bezdrátový pohybový senzor",4049.0,null,null,200135.0,"EnOcean sensore di movimento",109.9,null,null,200135.0,"EnOcean Bewegungsmelder",137.96,null,null,200135.0,"Enocean Bezdrátový pohybový senzor",109.9,null,null,200135.0,"Enocean Bewegingsmelder",109.9,null,null,"Not done","not translated yet","Not done",null,null,"Not done","not translated yet","Not done",null,"Not done","not translated yet","Not done",null,null,"Not done","not translated yet","Not done",null,null,"Not done","not translated yet","Not done",null,null,"Not done","not translated yet","Not done",null,null,"Not done","not translated yet","Not done",null,null,null,null,null,null,null,null,105.0,200135,200135,"not available in this country",200135,200135,200135,200135,200135,200135,200135,"Not done","Not done","Not done","Not done","Not done","Not done","Not done",null,null,null,null,"EnOcean Bewegungsmelder","Enocean Motion Sensor","not available in this country","Détecteur de présence EnOcean","Detector de presencia inalámbrico EnOcean","Enocean Bezdrátový pohybový senzor","EnOcean sensore di movimento","EnOcean Bewegungsmelder","Enocean Bezdrátový pohybový senzor","Enocean Bewegingsmelder","not translated yet","not translated yet","not translated yet","not translated yet","not translated yet","not translated yet","not translated yet",null,null,null,null,null,109.9,95,0,109.9,109.9,4049,109.9,137.96,109.9,109.9,"Not done","Not done","Not done","Not done","Not done","Not done","Not done"]
[200136.0,"Temp-/Feuchtefühler Sauna",149.9,null,null,200136.0,"Temperature & Humidity Sensor For Saunas",127.5,null,null,200136.0,"Temperature & Humidity Sensor For Saunas",205.0,null,null,200136.0,"Sonde de Temp & Hum pour Sauna",149.9,null,null,200136.0,"Sensor de temperatura y humedad para Sauna",149.9,null,null,200136.0,"Saunový senzor teplota/vlhkost",3999.0,null,null,200136.0,"Sensore temperatura/umidità sauna",149.9,null,null,200136.0,"Temp-/Feuchtefühler Sauna",184.26,null,null,200136.0,"Saunový senzor teplota/vlhkost",149.9,null,null,200136.0,"Temperatuur- & Vochtigheidsvoeler Sauna",149.9,null,null,"Not done","not translated yet","Not done",null,null,"Not done","not translated yet","Not done",null,"Not done","not translated yet","Not done",null,null,"Not done","not translated yet","Not done",null,null,"Not done","not translated yet","Not done",null,null,"Not done","not translated yet","Not done",null,null,"Not done","not translated yet","Not done",null,null,null,null,null,null,null,null,106.0,200136,200136,200136,200136,200136,200136,200136,200136,200136,200136,"Not done","Not done","Not done","Not done","Not done","Not done","Not done",null,null,null,null,"Temp-/Feuchtefühler Sauna","Temperature & Humidity Sensor For Saunas","Temperature & Humidity Sensor For Saunas","Sonde de Temp & Hum pour Sauna","Sensor de temperatura y humedad para Sauna","Saunový senzor teplota/vlhkost","Sensore temperatura/umidità sauna","Temp-/Feuchtefühler Sauna","Saunový senzor teplota/vlhkost","Temperatuur- & Vochtigheidsvoeler Sauna","not translated yet","not translated yet","not translated yet","not translated yet","not translated yet","not translated yet","not translated yet",null,null,null,null,null,149.9,127.5,205,149.9,149.9,3999,149.9,184.26,149.9,149.9,"Not done","Not done","Not done","Not done","Not done","Not done","Not done"]
[200137.0,"EnOcean Schaltaktor",74.9,null,null,200137.0,"Enocean Relay",65.0,null,null,"not available in this country","not available in this country",0.0,null,null,200137.0,"Actionneur EnOcean",74.9,null,null,200137.0,"Actuador inalámbrico EnOcean",74.9,null,null,200137.0,"EnOcean bezdrátový aktor",1999.0,null,null,200137.0,"EnOcean relè",74.9,null,null,200137.0,"EnOcean Schaltaktor",100.93,null,null,200137.0,"EnOcean bezdrátový aktor",74.9,null,null,200137.0,"Enocean Relais",74.9,null,null,"Not done","not translated yet","Not done",null,null,"Not done","not translated yet","Not done",null,"Not done","not translated yet","Not done",null,null,"Not done","not translated yet","Not done",null,null,"Not done","not translated yet","Not done",null,null,"Not done","not translated yet","Not done",null,null,"Not done","not translated yet","Not done",null,null,null,null,null,null,null,null,107.0,200137,200137,"not available in this country",200137,200137,200137,200137,200137,200137,200137,"Not done","Not done","Not done","Not done","Not done","Not done","Not done",null,null,null,null,"EnOcean Schaltaktor","Enocean Relay","not available in this country","Actionneur EnOcean","Actuador inalámbrico EnOcean","EnOcean bezdrátový aktor","EnOcean relè","EnOcean Schaltaktor","EnOcean bezdrátový aktor","Enocean Relais","not translated yet","not translated yet","not translated yet","not translated yet","not translated yet","not translated yet","not translated yet",null,null,null,null,null,74.9,65,0,74.9,74.9,1999,74.9,100.93,74.9,74.9,"Not done","Not done","Not done","Not done","Not done","Not done","Not done"]
[200143.0,"Netzteil 24V, 0,4A",26.9,null,null,200143.0,"24V Power Supply (0.4A)",25.0,null,null,200143.0,"24V Power Supply (0.4A)",36.0,null,null,200143.0,"Alimentation 24V 0,4A",26.9,null,null,200143.0,"Fuente de alimentación 24V, 0,4A",26.9,null,null,200143.0,"Zdroj 24V, 0,4A",749.0,null,null,200143.0,"Alimentatore 24V 0,4A",26.9,null,null,200143.0,"Netzteil 24V, 0,4A",33.29,null,null,200143.0,"Zdroj 24V, 0,4A",26.9,null,null,200143.0,"24V Voeding (0.4A)",26.9,null,null,"Not done","not translated yet","Not done",null,null,"Not done","not translated yet","Not done",null,"Not done","not translated yet","Not done",null,null,"Not done","not translated yet","Not done",null,null,"Not done","not translated yet","Not done",null,null,"Not done","not translated yet","Not done",null,null,"Not done","not translated yet","Not done",null,null,null,null,null,null,null,null,108.0,200143,200143,200143,200143,200143,200143,200143,200143,200143,200143,"Not done","Not done","Not done","Not done","Not done","Not done","Not done",null,null,null,null,"Netzteil 24V, 0,4A","24V Power Supply (0.4A)","24V Power Supply (0.4A)","Alimentation 24V 0,4A","Fuente de alimentación 24V, 0,4A","Zdroj 24V, 0,4A","Alimentatore 24V 0,4A","Netzteil 24V, 0,4A","Zdroj 24V, 0,4A","24V Voeding (0.4A)","not translated yet","not translated yet","not translated yet","not translated yet","not translated yet","not translated yet","not translated yet",null,null,null,null,null,26.9,25,36,26.9,26.9,749,26.9,33.29,26.9,26.9,"Not done","Not done","Not done","Not done","Not done","Not done","Not done"]
[200150.0,"Loxone Speaker Einbaubox",42.9,null,null,200150.0,"Loxone Speaker Back Box",37.5,null,null,200150.0,"Loxone Speaker Back Box",58.0,null,null,200150.0,"Loxone Speaker Back Box",42.9,null,null,200150.0,"Caja para empotrar Loxone Speaker",42.9,null,null,200150.0,"Instalační box pro Loxone reproduktor (speaker)",1199.0,null,null,200150.0,"Loxone Speaker box incasso",42.9,null,null,200150.0,"Loxone Speaker Einbaubox",57.36,null,null,200150.0,"Instalační box pro Loxone reproduktor (speaker)",42.9,null,null,200150.0,"Inbouwdoos Loxone Speaker",42.9,null,null,"Not done","not translated yet","Not done",null,null,"Not done","not translated yet","Not done",null,"Not done","not translated yet","Not done",null,null,"Not done","not translated yet","Not done",null,null,"Not done","not translated yet","Not done",null,null,"Not done","not translated yet","Not done",null,null,"Not done","not translated yet","Not done",null,null,null,null,null,null,null,null,109.0,200150,200150,200150,200150,200150,200150,200150,200150,200150,200150,"Not done","Not done","Not done","Not done","Not done","Not done","Not done",null,null,null,null,"Loxone Speaker Einbaubox","Loxone Speaker Back Box","Loxone Speaker Back Box","Loxone Speaker Back Box","Caja para empotrar Loxone Speaker","Instalační box pro Loxone reproduktor (speaker)","Loxone Speaker box incasso","Loxone Speaker Einbaubox","Instalační box pro Loxone reproduktor (speaker)","Inbouwdoos Loxone Speaker","not translated yet","not translated yet","not translated yet","not translated yet","not translated yet","not translated yet","not translated yet",null,null,null,null,null,42.9,37.5,58,42.9,42.9,1199,42.9,57.36,42.9,42.9,"Not done","Not done","Not done","Not done","Not done","Not done","Not done"]
[200151.0,"SMA Stabantenne 4dBi 868 MHz",20.75,null,null,200151.0,"SMA Antenna 4dBi 868 MHz",18.75,null,null,200151.0,"SMA Antenna 4dBi 868 MHz",29.9,null,null,200151.0,"Antenne SMA 4dBi 868 MHz",20.75,null,null,200151.0,"Antena de varilla SMA 4dBi 868 MHz",20.75,null,null,200151.0,"SMA Anténa 4dBi 868 MHz",579.0,null,null,200151.0,"SMA antenna 4dBi 868 MHz",20.75,null,null,200151.0,"SMA Stabantenne 4dBi 868 MHz",24.95,null,null,200151.0,"SMA Anténa 4dBi 868 MHz",20.75,null,null,200151.0,"SMA Antenne 4dBi 868 MHz",20.75,null,null,"Not done","not translated yet","Not done",null,null,"Not done","not translated yet","Not done",null,"Not done","not translated yet","Not done",null,null,"Not done","not translated yet","Not done",null,null,"Not done","not translated yet","Not done",null,null,"Not done","not translated yet","Not done",null,null,"Not done","not translated yet","Not done",null,null,null,null,null,null,null,null,110.0,200151,200151,200151,200151,200151,200151,200151,200151,200151,200151,"Not done","Not done","Not done","Not done","Not done","Not done","Not done",null,null,null,null,"SMA Stabantenne 4dBi 868 MHz","SMA Antenna 4dBi 868 MHz","SMA Antenna 4dBi 868 MHz","Antenne SMA 4dBi 868 MHz","Antena de varilla SMA 4dBi 868 MHz","SMA Anténa 4dBi 868 MHz","SMA antenna 4dBi 868 MHz","SMA Stabantenne 4dBi 868 MHz","SMA Anténa 4dBi 868 MHz","SMA Antenne 4dBi 868 MHz","not translated yet","not translated yet","not translated yet","not translated yet","not translated yet","not translated yet","not translated yet",null,null,null,null,null,20.75,18.75,29.9,20.75,20.75,579,20.75,24.95,20.75,20.75,"Not done","Not done","Not done","Not done","Not done","Not done","Not done"]
[200153.0,"Loxone Wall Speaker",110.0,null,null,200153.0,"Loxone Wall Speaker",95.0,null,null,200153.0,"Loxone Wall Speaker",149.0,null,null,200153.0,"Loxone Wall Speaker",110.0,null,null,200153.0,"Loxone Wall Speaker",110.0,null,null,200153.0,"Loxone Wall Speaker",3099.0,null,null,200153.0,"Loxone Wall Speaker",110.0,null,null,200153.0,"Loxone Wall Speaker",184.26,null,null,200153.0,"Loxone Wall Speaker",110.0,null,null,200153.0,"Loxone Wall Speaker",110.0,null,null,"Not done","not translated yet","Not done",null,null,"Not done","not translated yet","Not done",null,"Not done","not translated yet","Not done",null,null,"Not done","not translated yet","Not done",null,null,"Not done","not translated yet","Not done",null,null,"Not done","not translated yet","Not done",null,null,"Not done","not translated yet","Not done",null,null,null,null,null,null,null,null,111.0,200153,200153,200153,200153,200153,200153,200153,200153,200153,200153,"Not done","Not done","Not done","Not done","Not done","Not done","Not done",null,null,null,null,"Loxone Wall Speaker","Loxone Wall Speaker","Loxone Wall Speaker","Loxone Wall Speaker","Loxone Wall Speaker","Loxone Wall Speaker","Loxone Wall Speaker","Loxone Wall Speaker","Loxone Wall Speaker","Loxone Wall Speaker","not translated yet","not translated yet","not translated yet","not translated yet","not translated yet","not translated yet","not translated yet",null,null,null,null,null,110,95,149,110,110,3099,110,184.26,110,110,"Not done","Not done","Not done","Not done","Not done","Not done","Not done"]
[200154.0,"Drucksensor 0-10V",104.9,null,null,200154.0,"Pressure Sensor 0-10V",90.0,null,null,200154.0,"Pressure Sensor 0-10V",115.0,null,null,200154.0,"Sonde de pression 0-10V",104.9,null,null,200154.0,"Sensor de presión 0-10V",104.9,null,null,200154.0,"Senzor tlaku 0-10V",2849.0,null,null,200154.0,"Sensore pressione 0-10V",104.9,null,null,200154.0,"Drucksensor 0-10V",137.96,null,null,200154.0,"Senzor tlaku 0-10V",104.9,null,null,200154.0,"Druksensor 0-10V",104.9,null,null,"Not done","not translated yet","Not done",null,null,"Not done","not translated yet","Not done",null,"Not done","not translated yet","Not done",null,null,"Not done","not translated yet","Not done",null,null,"Not done","not translated yet","Not done",null,null,"Not done","not translated yet","Not done",null,null,"Not done","not translated yet","Not done",null,null,null,null,null,null,null,null,112.0,200154,200154,200154,200154,200154,200154,200154,200154,200154,200154,"Not done","Not done","Not done","Not done","Not done","Not done","Not done",null,null,null,null,"Drucksensor 0-10V","Pressure Sensor 0-10V","Pressure Sensor 0-10V","Sonde de pression 0-10V","Sensor de presión 0-10V","Senzor tlaku 0-10V","Sensore pressione 0-10V","Drucksensor 0-10V","Senzor tlaku 0-10V","Druksensor 0-10V","not translated yet","not translated yet","not translated yet","not translated yet","not translated yet","not translated yet","not translated yet",null,null,null,null,null,104.9,90,115,104.9,104.9,2849,104.9,137.96,104.9,104.9,"Not done","Not done","Not done","Not done","Not done","Not done","Not done"]
[200155.0,"Glasbruchmelder 24V",24.9,null,null,200155.0,"Glass Break Sensor 24V",22.5,null,null,200155.0,"Glass Break Sensor 24V",34.0,null,null,200155.0,"Détecteur bris de glace 24V",24.9,null,null,200155.0,"Detector de rotura de cristal 24V",24.9,null,null,200155.0,"Senzor rozbití okna 24V",699.0,null,null,200155.0,"Sensore rottura vetro 24V",24.9,null,null,200155.0,"Glasbruchmelder 24V",33.29,null,null,200155.0,"Senzor rozbití okna 24V",24.9,null,null,200155.0,"Glasbreuksensor 24V",24.9,null,null,"Not done","not translated yet","Not done",null,null,"Not done","not translated yet","Not done",null,"Not done","not translated yet","Not done",null,null,"Not done","not translated yet","Not done",null,null,"Not done","not translated yet","Not done",null,null,"Not done","not translated yet","Not done",null,null,"Not done","not translated yet","Not done",null,null,null,null,null,null,null,null,113.0,200155,200155,200155,200155,200155,200155,200155,200155,200155,200155,"Not done","Not done","Not done","Not done","Not done","Not done","Not done",null,null,null,null,"Glasbruchmelder 24V","Glass Break Sensor 24V","Glass Break Sensor 24V","Détecteur bris de glace 24V","Detector de rotura de cristal 24V","Senzor rozbití okna 24V","Sensore rottura vetro 24V","Glasbruchmelder 24V","Senzor rozbití okna 24V","Glasbreuksensor 24V","not translated yet","not translated yet","not translated yet","not translated yet","not translated yet","not translated yet","not translated yet",null,null,null,null,null,24.9,22.5,34,24.9,24.9,699,24.9,33.29,24.9,24.9,"Not done","Not done","Not done","Not done","Not done","Not done","Not done"]
[200156.0,"Modbus Energiezähler 1-phasig",139.0,null,null,200156.0,"Modbus Electricity Meter (Single Phase)",120.0,null,null,"not available in this country","not available in this country",0.0,null,null,200156.0,"Compteur d'énergie Modbus monophasé",139.0,null,null,200156.0,"Contador de energía Modbus monofásico",139.0,null,null,200156.0,"1-fázový elektroměr (Modbus)",3799.0,null,null,200156.0,"Modbus contatore energia 1-fase",139.0,null,null,200156.0,"Modbus Energiezähler 1-phasig",184.26,null,null,200156.0,"1-fázový elektroměr (Modbus)",139.0,null,null,200156.0,"Modbus energieteller 1-fasig",139.0,null,null,"Not done","not translated yet","Not done",null,null,"Not done","not translated yet","Not done",null,"Not done","not translated yet","Not done",null,null,"Not done","not translated yet","Not done",null,null,"Not done","not translated yet","Not done",null,null,"Not done","not translated yet","Not done",null,null,"Not done","not translated yet","Not done",null,null,null,null,null,null,null,null,114.0,200156,200156,"not available in this country",200156,200156,200156,200156,200156,200156,200156,"Not done","Not done","Not done","Not done","Not done","Not done","Not done",null,null,null,null,"Modbus Energiezähler 1-phasig","Modbus Electricity Meter (Single Phase)","not available in this country","Compteur d'énergie Modbus monophasé","Contador de energía Modbus monofásico","1-fázový elektroměr (Modbus)","Modbus contatore energia 1-fase","Modbus Energiezähler 1-phasig","1-fázový elektroměr (Modbus)","Modbus energieteller 1-fasig","not translated yet","not translated yet","not translated yet","not translated yet","not translated yet","not translated yet","not translated yet",null,null,null,null,null,139,120,0,139,139,3799,139,184.26,139,139,"Not done","Not done","Not done","Not done","Not done","Not done","Not done"]
[200157.0,"Modbus Energiezähler 3-phasig",249.0,null,null,200157.0,"Modbus Electricity Meter (Three Phase)",212.5,null,null,"not available in this country","not available in this country",0.0,null,null,200157.0,"Compteur d'énergie Modbus triphasé",249.0,null,null,200157.0,"Contador de energía Modbus trifásico",249.0,null,null,200157.0,"3-fázový elektroměr (Modbus)",6799.0,null,null,200157.0,"Modbus contatore energia 3-fasi",249.0,null,null,200157.0,"Modbus Energiezähler 3-phasig",313.89,null,null,200157.0,"3-fázový elektroměr (Modbus)",249.0,null,null,200157.0,"Modbus energieteller 3-fasig",249.0,null,null,"Not done","not translated yet","Not done",null,null,"Not done","not translated yet","Not done",null,"Not done","not translated yet","Not done",null,null,"Not done","not translated yet","Not done",null,null,"Not done","not translated yet","Not done",null,null,"Not done","not translated yet","Not done",null,null,"Not done","not translated yet","Not done",null,null,null,null,null,null,null,null,115.0,200157,200157,"not available in this country",200157,200157,200157,200157,200157,200157,200157,"Not done","Not done","Not done","Not done","Not done","Not done","Not done",null,null,null,null,"Modbus Energiezähler 3-phasig","Modbus Electricity Meter (Three Phase)","not available in this country","Compteur d'énergie Modbus triphasé","Contador de energía Modbus trifásico","3-fázový elektroměr (Modbus)","Modbus contatore energia 3-fasi","Modbus Energiezähler 3-phasig","3-fázový elektroměr (Modbus)","Modbus energieteller 3-fasig","not translated yet","not translated yet","not translated yet","not translated yet","not translated yet","not translated yet","not translated yet",null,null,null,null,null,249,212.5,0,249,249,6799,249,313.89,249,249,"Not done","Not done","Not done","Not done","Not done","Not done","Not done"]
[200158.0,"Baustellenschild",199.0,null,null,"NA","not available in this country",0.0,null,null,"not available in this country","not available in this country",0.0,null,null,"not available in this country","not available in this country",199.0,null,null,"not available in this country","not available in this country",0.0,"NO AVAIABLE IN LOXONE SHOP ES",null,"not available in this country","not available in this country",0.0,null,null,200158.0,"Espositore cantiere",199.0,null,null,200158.0,"Baustellenschild",184.26,null,null,"not available in this country","not available in this country",0.0,null,null,200158.0,"Bouwborden",199.0,null,null,"Not done","not translated yet","Not done",null,null,"Not done","not translated yet","Not done",null,"Not done","not translated yet","Not done",null,null,"Not done","not translated yet","Not done",null,null,"Not done","not translated yet","Not done",null,null,"Not done","not translated yet","Not done",null,null,"Not done","not translated yet","Not done",null,null,null,null,null,null,null,null,116.0,200158,"NA","not available in this country","not available in this country","not available in this country","not available in this country",200158,200158,"not available in this country",200158,"Not done","Not done","Not done","Not done","Not done","Not done","Not done",null,null,null,null,"Baustellenschild","not available in this country","not available in this country","not available in this country","not available in this country","not available in this country","Espositore cantiere","Baustellenschild","not available in this country","Bouwborden","not translated yet","not translated yet","not translated yet","not translated yet","not translated yet","not translated yet","not translated yet",null,null,null,null,null,199,0,0,199,0,0,199,184.26,0,199,"Not done","Not done","Not done","Not done","Not done","Not done","Not done"]
[200168.0,"Potenzialverteiler PPV8 (20 Stk.)",195.0,null,null,200168.0,"Push In Terminal Block 8x4 Interconnected (20 pcs)",165.0,null,null,200168.0,"Push In Terminal Block 8x4 Interconnected (20 pcs)",265.0,null,null,200168.0,"Bornier 8x4 interconnectés (20 pcs)",195.0,null,null,200168.0,"Borne para distribuidor de potencial 8x4 PPV8",195.0,null,null,200168.0,"Svorka na DIN lištu PPV8 (20 kusů)",5499.0,null,null,200168.0,"Ripartitori di potenziale PPV8 (20pz.)",195.0,null,null,200168.0,"Potenzialverteiler PPV8 (20 Stk.)",202.78,null,null,200168.0,"Svorka na DIN lištu PPV8 (20 kusů)",195.0,null,null,200168.0,"Potentieel verdeler PPV8 (20 stuks)",195.0,null,null,"Not done","not translated yet","Not done",null,null,"Not done","not translated yet","Not done",null,"Not done","not translated yet","Not done",null,null,"Not done","not translated yet","Not done",null,null,"Not done","not translated yet","Not done",null,null,"Not done","not translated yet","Not done",null,null,"Not done","not translated yet","Not done",null,null,null,null,null,null,null,null,117.0,200168,200168,200168,200168,200168,200168,200168,200168,200168,200168,"Not done","Not done","Not done","Not done","Not done","Not done","Not done",null,null,null,null,"Potenzialverteiler PPV8 (20 Stk.)","Push In Terminal Block 8x4 Interconnected (20 pcs)","Push In Terminal Block 8x4 Interconnected (20 pcs)","Bornier 8x4 interconnectés (20 pcs)","Borne para distribuidor de potencial 8x4 PPV8","Svorka na DIN lištu PPV8 (20 kusů)","Ripartitori di potenziale PPV8 (20pz.)","Potenzialverteiler PPV8 (20 Stk.)","Svorka na DIN lištu PPV8 (20 kusů)","Potentieel verdeler PPV8 (20 stuks)","not translated yet","not translated yet","not translated yet","not translated yet","not translated yet","not translated yet","not translated yet",null,null,null,null,null,195,165,265,195,195,5499,195,202.78,195,195,"Not done","Not done","Not done","Not done","Not done","Not done","Not done"]
[200169.0,"Rangierverteiler PRV8 (20 Stk.)",185.0,null,null,200169.0,"Push In Terminal Block 8x4 Seperated (20pcs)",157.5,null,null,200169.0,"Push In Terminal Block 8x4 Seperated (20pcs)",249.0,null,null,200169.0,"Bornier 8x4 Séparés (20pcs)",185.0,null,null,200169.0,"Borne para distribuidor de señales 8x4 PRV8",185.0,null,null,200169.0,"Propojovací rozvaděč PRV8 (20 kusů)",5199.0,null,null,200169.0,"Ripartitori di derivazione PRV8 (20pz.)",185.0,null,null,200169.0,"Rangierverteiler PRV8 (20 Stk.)",193.52,null,null,200169.0,"Propojovací rozvaděč PRV8 (20 kusů)",185.0,null,null,200169.0,"Patch verdeler PRV8 (20 stuks)",185.0,null,null,"Not done","not translated yet","Not done",null,null,"Not done","not translated yet","Not done",null,"Not done","not translated yet","Not done",null,null,"Not done","not translated yet","Not done",null,null,"Not done","not translated yet","Not done",null,null,"Not done","not translated yet","Not done",null,null,"Not done","not translated yet","Not done",null,null,null,null,null,null,null,null,118.0,200169,200169,200169,200169,200169,200169,200169,200169,200169,200169,"Not done","Not done","Not done","Not done","Not done","Not done","Not done",null,null,null,null,"Rangierverteiler PRV8 (20 Stk.)","Push In Terminal Block 8x4 Seperated (20pcs)","Push In Terminal Block 8x4 Seperated (20pcs)","Bornier 8x4 Séparés (20pcs)","Borne para distribuidor de señales 8x4 PRV8","Propojovací rozvaděč PRV8 (20 kusů)","Ripartitori di derivazione PRV8 (20pz.)","Rangierverteiler PRV8 (20 Stk.)","Propojovací rozvaděč PRV8 (20 kusů)","Patch verdeler PRV8 (20 stuks)","not translated yet","not translated yet","not translated yet","not translated yet","not translated yet","not translated yet","not translated yet",null,null,null,null,null,185,157.5,249,185,185,5199,185,193.52,185,185,"Not done","Not done","Not done","Not done","Not done","Not done","Not done"]
[200170.0,"Trennwand P-Reihe",10.0,null,null,200170.0,"Partition for 8x4 Terminals (10pcs)",8.5,null,null,200170.0,"Partition for 8x4 Terminals (10pcs)",14.0,null,null,200170.0,"Séparation pour bornier (10pcs)",10.0,null,null,200170.0,"Separador para bornes",10.0,null,null,200170.0,"Předělovací deska PRV8 (10 kusů)",299.0,null,null,200170.0,"Piastra di separazione P-serie (10pz.)",10.0,null,null,200170.0,"Trennwand P-Reihe",11.07,null,null,200170.0,"Předělovací deska PRV8 (10 kusů)",10.0,null,null,200170.0,"Scheidingsplaat P-serie (10 stuks)",10.0,null,null,"Not done","not translated yet","Not done",null,null,"Not done","not translated yet","Not done",null,"Not done","not translated yet","Not done",null,null,"Not done","not translated yet","Not done",null,null,"Not done","not translated yet","Not done",null,null,"Not done","not translated yet","Not done",null,null,"Not done","not translated yet","Not done",null,null,null,null,null,null,null,null,119.0,200170,200170,200170,200170,200170,200170,200170,200170,200170,200170,"Not done","Not done","Not done","Not done","Not done","Not done","Not done",null,null,null,null,"Trennwand P-Reihe","Partition for 8x4 Terminals (10pcs)","Partition for 8x4 Terminals (10pcs)","Séparation pour bornier (10pcs)","Separador para bornes","Předělovací deska PRV8 (10 kusů)","Piastra di separazione P-serie (10pz.)","Trennwand P-Reihe","Předělovací deska PRV8 (10 kusů)","Scheidingsplaat P-serie (10 stuks)","not translated yet","not translated yet","not translated yet","not translated yet","not translated yet","not translated yet","not translated yet",null,null,null,null,null,10,8.5,14,10,10,299,10,11.07,10,10,"Not done","Not done","Not done","Not done","Not done","Not done","Not done"]
[200171.0,"Bezeichnungsträger P-Reihe",25.0,null,null,200171.0,"Label Holder 8 Levels (20 pcs)",21.25,null,null,200171.0,"Label Holder 8 Levels (20 pcs)",34.0,null,null,200171.0,"Porte étiquette (8 niveaux) (20 pcs)",25.0,null,null,200171.0,"Soporte de señalización para bornes (8 pisos)",25.0,null,null,200171.0,"Držák na značky pro PPV8/PRV8 (20 kusů)",699.0,null,null,200171.0,"Supporto per siglatura P-serie (20pz.)",25.0,null,null,200171.0,"Bezeichnungsträger P-Reihe",26.81,null,null,200171.0,"Držák na značky pro PPV8/PRV8 (20 kusů)",25.0,null,null,200171.0,"Markering houder P-serie (20 stuks)",25.0,null,null,"Not done","not translated yet","Not done",null,null,"Not done","not translated yet","Not done",null,"Not done","not translated yet","Not done",null,null,"Not done","not translated yet","Not done",null,null,"Not done","not translated yet","Not done",null,null,"Not done","not translated yet","Not done",null,null,"Not done","not translated yet","Not done",null,null,null,null,null,null,null,null,120.0,200171,200171,200171,200171,200171,200171,200171,200171,200171,200171,"Not done","Not done","Not done","Not done","Not done","Not done","Not done",null,null,null,null,"Bezeichnungsträger P-Reihe","Label Holder 8 Levels (20 pcs)","Label Holder 8 Levels (20 pcs)","Porte étiquette (8 niveaux) (20 pcs)","Soporte de señalización para bornes (8 pisos)","Držák na značky pro PPV8/PRV8 (20 kusů)","Supporto per siglatura P-serie (20pz.)","Bezeichnungsträger P-Reihe","Držák na značky pro PPV8/PRV8 (20 kusů)","Markering houder P-serie (20 stuks)","not translated yet","not translated yet","not translated yet","not translated yet","not translated yet","not translated yet","not translated yet",null,null,null,null,null,25,21.25,34,25,25,699,25,26.81,25,25,"Not done","Not done","Not done","Not done","Not done","Not done","Not done"]
[200172.0,"Abschlussplatte P-Reihe",5.0,null,null,200172.0,"End Plate for 8x4 Terminals (10 pcs)",4.25,null,null,200172.0,"End Plate for 8x4 Terminals (10 pcs)",7.0,null,null,200172.0,"Plaque de fin pour bornier 8x4 (10 pcs)",5.0,null,null,200172.0,"Tapa final para borne 8x4",5.0,null,null,200172.0,"Bočnice pro PPV8/PRV8 (10 kusů)",139.0,null,null,200172.0,"Piastra terminale P-serie (10pz.)",5.0,null,null,200172.0,"Abschlussplatte P-Reihe",5.69,null,null,200172.0,"Bočnice pro PPV8/PRV8 (10 kusů)",5.0,null,null,200172.0,"Afsluitplaat P-serie (10 stuks)",5.0,null,null,"Not done","not translated yet","Not done",null,null,"Not done","not translated yet","Not done",null,"Not done","not translated yet","Not done",null,null,"Not done","not translated yet","Not done",null,null,"Not done","not translated yet","Not done",null,null,"Not done","not translated yet","Not done",null,null,"Not done","not translated yet","Not done",null,null,null,null,null,null,null,null,121.0,200172,200172,200172,200172,200172,200172,200172,200172,200172,200172,"Not done","Not done","Not done","Not done","Not done","Not done","Not done",null,null,null,null,"Abschlussplatte P-Reihe","End Plate for 8x4 Terminals (10 pcs)","End Plate for 8x4 Terminals (10 pcs)","Plaque de fin pour bornier 8x4 (10 pcs)","Tapa final para borne 8x4","Bočnice pro PPV8/PRV8 (10 kusů)","Piastra terminale P-serie (10pz.)","Abschlussplatte P-Reihe","Bočnice pro PPV8/PRV8 (10 kusů)","Afsluitplaat P-serie (10 stuks)","not translated yet","not translated yet","not translated yet","not translated yet","not translated yet","not translated yet","not translated yet",null,null,null,null,null,5,4.25,7,5,5,139,5,5.69,5,5,"Not done","Not done","Not done","Not done","Not done","Not done","Not done"]
[200173.0,"Jalousie Anschlussklemme PMAK4",190.0,null,null,200173.0,"Push In Terminal Block 3+Earth (50 pcs)",162.5,null,null,200173.0,"Push In Terminal Block 3+Earth (50 pcs)",259.0,null,null,200173.0,"Bornier 3 + terre PMAK4 (50 pcs)",190.0,null,null,200173.0,"Borne de 3 + tierra PMAK4",190.0,null,null,200173.0,"Svorka pro připojení motoru PMAK4 (50 kusů)",5299.0,null,null,200173.0,"Morsetto componibile colleg. motore PMAK4 (50pz.)",190.0,null,null,200173.0,"Jalousie Anschlussklemme PMAK4",193.52,null,null,200173.0,"Svorka pro připojení motoru PMAK4 (50 kusů)",190.0,null,null,200173.0,"motor aansluitklem PMAK4 (50 stuks)",190.0,null,null,"Not done","not translated yet","Not done",null,null,"Not done","not translated yet","Not done",null,"Not done","not translated yet","Not done",null,null,"Not done","not translated yet","Not done",null,null,"Not done","not translated yet","Not done",null,null,"Not done","not translated yet","Not done",null,null,"Not done","not translated yet","Not done",null,null,null,null,null,null,null,null,122.0,200173,200173,200173,200173,200173,200173,200173,200173,200173,200173,"Not done","Not done","Not done","Not done","Not done","Not done","Not done",null,null,null,null,"Jalousie Anschlussklemme PMAK4","Push In Terminal Block 3+Earth (50 pcs)","Push In Terminal Block 3+Earth (50 pcs)","Bornier 3 + terre PMAK4 (50 pcs)","Borne de 3 + tierra PMAK4","Svorka pro připojení motoru PMAK4 (50 kusů)","Morsetto componibile colleg. motore PMAK4 (50pz.)","Jalousie Anschlussklemme PMAK4","Svorka pro připojení motoru PMAK4 (50 kusů)","motor aansluitklem PMAK4 (50 stuks)","not translated yet","not translated yet","not translated yet","not translated yet","not translated yet","not translated yet","not translated yet",null,null,null,null,null,190,162.5,259,190,190,5299,190,193.52,190,190,"Not done","Not done","Not done","Not done","Not done","Not done","Not done"]
[200174.0,"Abschlussplatte PMAK4",10.0,null,null,200174.0,"End Plate for 3+Earth Terminals (20 pcs)",8.75,null,null,200174.0,"End Plate for 3+Earth Terminals (20 pcs)",14.0,null,null,200174.0,"Plaque de fin pour bornier 3 + terre PMAK4 (20 pcs)",10.0,null,null,200174.0,"Tapa final para borne de 3 + tierra PMAK4",10.0,null,null,200174.0,"Bočnice pro PMAK4 (20 kusů)",279.0,null,null,200174.0,"Piastra terminale PMAK4 (20pz.)",10.0,null,null,200174.0,"Abschlussplatte PMAK4",11.07,null,null,200174.0,"Bočnice pro PMAK4 (20 kusů)",10.0,null,null,200174.0,"Afsluitplaat PMAK4 (20 stuks)",10.0,null,null,"Not done","not translated yet","Not done",null,null,"Not done","not translated yet","Not done",null,"Not done","not translated yet","Not done",null,null,"Not done","not translated yet","Not done",null,null,"Not done","not translated yet","Not done",null,null,"Not done","not translated yet","Not done",null,null,"Not done","not translated yet","Not done",null,null,null,null,null,null,null,null,123.0,200174,200174,200174,200174,200174,200174,200174,200174,200174,200174,"Not done","Not done","Not done","Not done","Not done","Not done","Not done",null,null,null,null,"Abschlussplatte PMAK4","End Plate for 3+Earth Terminals (20 pcs)","End Plate for 3+Earth Terminals (20 pcs)","Plaque de fin pour bornier 3 + terre PMAK4 (20 pcs)","Tapa final para borne de 3 + tierra PMAK4","Bočnice pro PMAK4 (20 kusů)","Piastra terminale PMAK4 (20pz.)","Abschlussplatte PMAK4","Bočnice pro PMAK4 (20 kusů)","Afsluitplaat PMAK4 (20 stuks)","not translated yet","not translated yet","not translated yet","not translated yet","not translated yet","not translated yet","not translated yet",null,null,null,null,null,10,8.75,14,10,10,279,10,11.07,10,10,"Not done","Not done","Not done","Not done","Not done","Not done","Not done"]
[200175.0,"Installations-Reihenklemme PDL",100.0,null,null,200175.0,"Push In Terminal Block Twin+Earth (50 pcs)",85.0,null,null,200175.0,"Push In Terminal Block Twin+Earth (50 pcs)",141.5,null,null,200175.0,"Bornier 2 + Terre PDL (50 pcs)",100.0,null,null,200175.0,"Borne de 2 + tierra PDL",100.0,null,null,200175.0,"Svorkovnice PDL (50 kusů)",2799.0,null,null,200175.0,"Morsetto per installazione ai piani PDL (50pz.)",100.0,null,null,200175.0,"Installations-Reihenklemme PDL",110.19,null,null,200175.0,"Svorkovnice PDL (50 kusů)",100.0,null,null,200175.0,"Installatie klem PDL",100.0,null,null,"Not done","not translated yet","Not done",null,null,"Not done","not translated yet","Not done",null,"Not done","not translated yet","Not done",null,null,"Not done","not translated yet","Not done",null,null,"Not done","not translated yet","Not done",null,null,"Not done","not translated yet","Not done",null,null,"Not done","not translated yet","Not done",null,null,null,null,null,null,null,null,124.0,200175,200175,200175,200175,200175,200175,200175,200175,200175,200175,"Not done","Not done","Not done","Not done","Not done","Not done","Not done",null,null,null,null,"Installations-Reihenklemme PDL","Push In Terminal Block Twin+Earth (50 pcs)","Push In Terminal Block Twin+Earth (50 pcs)","Bornier 2 + Terre PDL (50 pcs)","Borne de 2 + tierra PDL","Svorkovnice PDL (50 kusů)","Morsetto per installazione ai piani PDL (50pz.)","Installations-Reihenklemme PDL","Svorkovnice PDL (50 kusů)","Installatie klem PDL","not translated yet","not translated yet","not translated yet","not translated yet","not translated yet","not translated yet","not translated yet",null,null,null,null,null,100,85,141.5,100,100,2799,100,110.19,100,100,"Not done","Not done","Not done","Not done","Not done","Not done","Not done"]
[200176.0,"Abschlussplatte PDL",7.0,null,null,200176.0,"End Plate for Twin+Earth Terminals (20 pcs)",6.25,null,null,200176.0,"End Plate for Twin+Earth Terminals (20 pcs)",10.0,null,null,200176.0,"Plaque de fin pour bornier 2 + terre PDL (20 pcs)",7.0,null,null,200176.0,"Tapa final para borne de 2 + tierra PDL",7.0,null,null,200176.0,"Bočnice pro PDL (20 kusů)",199.0,null,null,200176.0,"Piastra terminale PDL (20pz.)",7.0,null,null,200176.0,"Abschlussplatte PDL",8.19,null,null,200176.0,"Bočnice pro PDL (20 kusů)",7.0,null,null,200176.0,"Afsluitplaat PDL (20 stuks)",7.0,null,null,"Not done","not translated yet","Not done",null,null,"Not done","not translated yet","Not done",null,"Not done","not translated yet","Not done",null,null,"Not done","not translated yet","Not done",null,null,"Not done","not translated yet","Not done",null,null,"Not done","not translated yet","Not done",null,null,"Not done","not translated yet","Not done",null,null,null,null,null,null,null,null,125.0,200176,200176,200176,200176,200176,200176,200176,200176,200176,200176,"Not done","Not done","Not done","Not done","Not done","Not done","Not done",null,null,null,null,"Abschlussplatte PDL","End Plate for Twin+Earth Terminals (20 pcs)","End Plate for Twin+Earth Terminals (20 pcs)","Plaque de fin pour bornier 2 + terre PDL (20 pcs)","Tapa final para borne de 2 + tierra PDL","Bočnice pro PDL (20 kusů)","Piastra terminale PDL (20pz.)","Abschlussplatte PDL","Bočnice pro PDL (20 kusů)","Afsluitplaat PDL (20 stuks)","not translated yet","not translated yet","not translated yet","not translated yet","not translated yet","not translated yet","not translated yet",null,null,null,null,null,7,6.25,10,7,7,199,7,8.19,7,7,"Not done","Not done","Not done","Not done","Not done","Not done","Not done"]
[200177.0,"Endwinkel ZEW 35",7.0,null,null,200177.0,"End Bracket (20 pcs)",6.25,null,null,200177.0,"End Bracket (20 pcs)",10.0,null,null,200177.0,"Délimitateur de rail Din (20 pcs)",7.0,null,null,200177.0,"Ángulo de fijación lateral ZEW 35",7.0,null,null,200177.0,"Koncová podpěra svorkovnice ZEW 35 (20 kusů)",199.0,null,null,200177.0,"Terminale di fissaggio ZEW 35 (20pz.)",7.0,null,null,200177.0,"Endwinkel ZEW 35",8.19,null,null,200177.0,"Koncová podpěra svorkovnice ZEW 35 (20 kusů)",7.0,null,null,200177.0,"Eind klem ZEW (20 stuks)",7.0,null,null,"Not done","not translated yet","Not done",null,null,"Not done","not translated yet","Not done",null,"Not done","not translated yet","Not done",null,null,"Not done","not translated yet","Not done",null,null,"Not done","not translated yet","Not done",null,null,"Not done","not translated yet","Not done",null,null,"Not done","not translated yet","Not done",null,null,null,null,null,null,null,null,126.0,200177,200177,200177,200177,200177,200177,200177,200177,200177,200177,"Not done","Not done","Not done","Not done","Not done","Not done","Not done",null,null,null,null,"Endwinkel ZEW 35","End Bracket (20 pcs)","End Bracket (20 pcs)","Délimitateur de rail Din (20 pcs)","Ángulo de fijación lateral ZEW 35","Koncová podpěra svorkovnice ZEW 35 (20 kusů)","Terminale di fissaggio ZEW 35 (20pz.)","Endwinkel ZEW 35","Koncová podpěra svorkovnice ZEW 35 (20 kusů)","Eind klem ZEW (20 stuks)","not translated yet","not translated yet","not translated yet","not translated yet","not translated yet","not translated yet","not translated yet",null,null,null,null,null,7,6.25,10,7,7,199,7,8.19,7,7,"Not done","Not done","Not done","Not done","Not done","Not done","Not done"]
[200178.0,"Sicherungs-Reihenklemme",120.0,null,null,200178.0,"Push in Fused Terminal Block (25 pcs)",100.0,null,null,200178.0,"Push in Fused Terminal Block (25 pcs)",159.0,null,null,200178.0,"Bloc de terminal de fusible à connexion rapide (25 pcs)",120.0,null,null,200178.0,"Borne portafusibles",120.0,null,null,200178.0,"Pojistková svorkovnice (25 kusů)",3399.0,null,null,200178.0,"Morsetto componibile portafusibile (25pz.)",120.0,null,null,200178.0,"Sicherungs-Reihenklemme",119.44,null,null,200178.0,"Pojistková svorkovnice (25 kusů)",120.0,null,null,200178.0,"Zekering klem (25 stuks)",120.0,null,null,"Not done","not translated yet","Not done",null,null,"Not done","not translated yet","Not done",null,"Not done","not translated yet","Not done",null,null,"Not done","not translated yet","Not done",null,null,"Not done","not translated yet","Not done",null,null,"Not done","not translated yet","Not done",null,null,"Not done","not translated yet","Not done",null,null,null,null,null,null,null,null,127.0,200178,200178,200178,200178,200178,200178,200178,200178,200178,200178,"Not done","Not done","Not done","Not done","Not done","Not done","Not done",null,null,null,null,"Sicherungs-Reihenklemme","Push in Fused Terminal Block (25 pcs)","Push in Fused Terminal Block (25 pcs)","Bloc de terminal de fusible à connexion rapide (25 pcs)","Borne portafusibles","Pojistková svorkovnice (25 kusů)","Morsetto componibile portafusibile (25pz.)","Sicherungs-Reihenklemme","Pojistková svorkovnice (25 kusů)","Zekering klem (25 stuks)","not translated yet","not translated yet","not translated yet","not translated yet","not translated yet","not translated yet","not translated yet",null,null,null,null,null,120,100,159,120,120,3399,120,119.44,120,120,"Not done","Not done","Not done","Not done","Not done","Not done","Not done"]
[200179.0,"Abschlussplatte Sicherungskl.",16.0,null,null,200179.0,"End Plate For Fused Terminals (50 pcs)",13.5,null,null,200179.0,"End Plate For Fused Terminals (50 pcs)",22.0,null,null,200179.0,"Plaque de fin pour terminal de fusible (50 pcs)",16.0,null,null,200179.0,"Tapa final para borne portafusibles",16.0,null,null,200179.0,"Bočnice pojistkové svorkovnice (50 kusů)",449.0,null,null,200179.0,"Piastra terminale portafusibile (50pz.)",16.0,null,null,200179.0,"Abschlussplatte Sicherungskl.",16.62,null,null,200179.0,"Bočnice pojistkové svorkovnice (50 kusů)",16.0,null,null,200179.0,"Afsluitplaat zekering klem (50 pcs)",16.0,null,null,"Not done","not translated yet","Not done",null,null,"Not done","not translated yet","Not done",null,"Not done","not translated yet","Not done",null,null,"Not done","not translated yet","Not done",null,null,"Not done","not translated yet","Not done",null,null,"Not done","not translated yet","Not done",null,null,"Not done","not translated yet","Not done",null,null,null,null,null,null,null,null,128.0,200179,200179,200179,200179,200179,200179,200179,200179,200179,200179,"Not done","Not done","Not done","Not done","Not done","Not done","Not done",null,null,null,null,"Abschlussplatte Sicherungskl.","End Plate For Fused Terminals (50 pcs)","End Plate For Fused Terminals (50 pcs)","Plaque de fin pour terminal de fusible (50 pcs)","Tapa final para borne portafusibles","Bočnice pojistkové svorkovnice (50 kusů)","Piastra terminale portafusibile (50pz.)","Abschlussplatte Sicherungskl.","Bočnice pojistkové svorkovnice (50 kusů)","Afsluitplaat zekering klem (50 pcs)","not translated yet","not translated yet","not translated yet","not translated yet","not translated yet","not translated yet","not translated yet",null,null,null,null,null,16,13.5,22,16,16,449,16,16.62,16,16,"Not done","Not done","Not done","Not done","Not done","Not done","Not done"]
[200180.0,"Querverbinder 24 Polig (10 Stück)",60.0,null,null,200180.0,"Cross Connector For Fused Terminals (10 pcs)",50.0,null,null,200180.0,"Cross Connector For Fused Terminals (10 pcs)",79.0,null,null,200180.0,"Connecteur en croix pour terminal de fusible (10 pcs)",60.0,null,null,200180.0,"Conector transversal para borne portafusibles 24 Polig",60.0,null,null,200180.0,"24 pólová propojka (10 kusů)",1699.0,null,null,200180.0,"Collegamento trasversale 24 poli (10pz.)",60.0,null,null,200180.0,"Querverbinder 24 Polig (10 Stück)",64.77,null,null,200180.0,"24 pólová propojka (10 kusů)",60.0,null,null,200180.0,"Dwarsconnector 24 polig (10 pcs)",60.0,null,null,"Not done","not translated yet","Not done",null,null,"Not done","not translated yet","Not done",null,"Not done","not translated yet","Not done",null,null,"Not done","not translated yet","Not done",null,null,"Not done","not translated yet","Not done",null,null,"Not done","not translated yet","Not done",null,null,"Not done","not translated yet","Not done",null,null,null,null,null,null,null,null,129.0,200180,200180,200180,200180,200180,200180,200180,200180,200180,200180,"Not done","Not done","Not done","Not done","Not done","Not done","Not done",null,null,null,null,"Querverbinder 24 Polig (10 Stück)","Cross Connector For Fused Terminals (10 pcs)","Cross Connector For Fused Terminals (10 pcs)","Connecteur en croix pour terminal de fusible (10 pcs)","Conector transversal para borne portafusibles 24 Polig","24 pólová propojka (10 kusů)","Collegamento trasversale 24 poli (10pz.)","Querverbinder 24 Polig (10 Stück)","24 pólová propojka (10 kusů)","Dwarsconnector 24 polig (10 pcs)","not translated yet","not translated yet","not translated yet","not translated yet","not translated yet","not translated yet","not translated yet",null,null,null,null,null,60,50,79,60,60,1699,60,64.77,60,60,"Not done","Not done","Not done","Not done","Not done","Not done","Not done"]
[200181.0,"Sicherung 2A",9.0,null,null,200181.0,"Blade Fuse 2A (100 pcs)",7.5,null,null,200181.0,"Blade Fuse 2A (100 pcs)",13.0,null,null,200181.0,"Fusible 2A (100 pcs)",9.0,null,null,200181.0,"Fusible 2A",9.0,null,null,200181.0,"Pojistky 2A (100 kusů)",249.0,null,null,200181.0,"Fusibile 2A (100pz.)",9.0,null,null,200181.0,"Sicherung 2A",9.82,null,null,200181.0,"Pojistky 2A (100 kusů)",9.0,null,null,200181.0,"Zekering 2A (100 pcs)",9.0,null,null,"Not done","not translated yet","Not done",null,null,"Not done","not translated yet","Not done",null,"Not done","not translated yet","Not done",null,null,"Not done","not translated yet","Not done",null,null,"Not done","not translated yet","Not done",null,null,"Not done","not translated yet","Not done",null,null,"Not done","not translated yet","Not done",null,null,null,null,null,null,null,null,130.0,200181,200181,200181,200181,200181,200181,200181,200181,200181,200181,"Not done","Not done","Not done","Not done","Not done","Not done","Not done",null,null,null,null,"Sicherung 2A","Blade Fuse 2A (100 pcs)","Blade Fuse 2A (100 pcs)","Fusible 2A (100 pcs)","Fusible 2A","Pojistky 2A (100 kusů)","Fusibile 2A (100pz.)","Sicherung 2A","Pojistky 2A (100 kusů)","Zekering 2A (100 pcs)","not translated yet","not translated yet","not translated yet","not translated yet","not translated yet","not translated yet","not translated yet",null,null,null,null,null,9,7.5,13,9,9,249,9,9.82,9,9,"Not done","Not done","Not done","Not done","Not done","Not done","Not done"]
[200183.0,"Sicherung 5A",9.0,null,null,200183.0,"Blade Fuse 5A (100 pcs)",7.5,null,null,200183.0,"Blade Fuse 5A (100 pcs)",13.0,null,null,200183.0,"Fusible 5A (100 pcs)",9.0,null,null,200183.0,"Fusible 5A",9.0,null,null,200183.0,"Pojistky 5A (100 kusů)",249.0,null,null,200183.0,"Fusibile 5A (100pz.)",9.0,null,null,200183.0,"Sicherung 5A",9.82,null,null,200183.0,"Pojistky 5A (100 kusů)",9.0,null,null,200183.0,"Zekering 5A (100 pcs)",9.0,null,null,"Not done","not translated yet","Not done",null,null,"Not done","not translated yet","Not done",null,"Not done","not translated yet","Not done",null,null,"Not done","not translated yet","Not done",null,null,"Not done","not translated yet","Not done",null,null,"Not done","not translated yet","Not done",null,null,"Not done","not translated yet","Not done",null,null,null,null,null,null,null,null,131.0,200183,200183,200183,200183,200183,200183,200183,200183,200183,200183,"Not done","Not done","Not done","Not done","Not done","Not done","Not done",null,null,null,null,"Sicherung 5A","Blade Fuse 5A (100 pcs)","Blade Fuse 5A (100 pcs)","Fusible 5A (100 pcs)","Fusible 5A","Pojistky 5A (100 kusů)","Fusibile 5A (100pz.)","Sicherung 5A","Pojistky 5A (100 kusů)","Zekering 5A (100 pcs)","not translated yet","not translated yet","not translated yet","not translated yet","not translated yet","not translated yet","not translated yet",null,null,null,null,null,9,7.5,13,9,9,249,9,9.82,9,9,"Not done","Not done","Not done","Not done","Not done","Not done","Not done"]
[200184.0,"Sicherung 10A",9.0,null,null,200184.0,"Blade Fuse 10A (100 pcs)",7.5,null,null,200184.0,"Blade Fuse 10A (100 pcs)",13.0,null,null,200184.0,"Fusible 10A (100 pcs)",9.0,null,null,200184.0,"Fusible 10A",9.0,null,null,200184.0,"Pojistky 10A (100 kusů)",249.0,null,null,200184.0,"Fusibile 10A (100pz.)",9.0,null,null,200184.0,"Sicherung 10A",9.82,null,null,200184.0,"Pojistky 10A (100 kusů)",9.0,null,null,200184.0,"Zekering 10A (100 pcs)",9.0,null,null,"Not done","not translated yet","Not done",null,null,"Not done","not translated yet","Not done",null,"Not done","not translated yet","Not done",null,null,"Not done","not translated yet","Not done",null,null,"Not done","not translated yet","Not done",null,null,"Not done","not translated yet","Not done",null,null,"Not done","not translated yet","Not done",null,null,null,null,null,null,null,null,132.0,200184,200184,200184,200184,200184,200184,200184,200184,200184,200184,"Not done","Not done","Not done","Not done","Not done","Not done","Not done",null,null,null,null,"Sicherung 10A","Blade Fuse 10A (100 pcs)","Blade Fuse 10A (100 pcs)","Fusible 10A (100 pcs)","Fusible 10A","Pojistky 10A (100 kusů)","Fusibile 10A (100pz.)","Sicherung 10A","Pojistky 10A (100 kusů)","Zekering 10A (100 pcs)","not translated yet","not translated yet","not translated yet","not translated yet","not translated yet","not translated yet","not translated yet",null,null,null,null,null,9,7.5,13,9,9,249,9,9.82,9,9,"Not done","Not done","Not done","Not done","Not done","Not done","Not done"]
[200186.0,"Loxone Folder Set",3.0,null,null,200186.0,"Loxone Brochure (25 pcs)",0.5,null,null,200186.0,"Loxone Brochure (25 pcs)",5.0,null,null,200186.0,"Loxone Brochure (25 pcs)",3.0,null,null,200186.0,"Catálogo Loxone",3.0,null,null,200193.0,"Loxone brožurka - 25 kusů",85.0,null,null,200186.0,"Loxone Folder Set",3.0,null,null,200186.0,"Loxone Folder Set",4.58,null,null,200193.0,"Loxone brožurka - 25 kusů",3.0,null,null,200292.0,"Loxone Brochure NL (25 pcs)",3.0,null,null,"Not done","not translated yet","Not done",null,null,"Not done","not translated yet","Not done",null,"Not done","not translated yet","Not done",null,null,"Not done","not translated yet","Not done",null,null,"Not done","not translated yet","Not done",null,null,"Not done","not translated yet","Not done",null,null,"Not done","not translated yet","Not done",null,null,null,null,null,null,null,null,133.0,200186,200186,200186,200186,200186,200193,200186,200186,200193,200292,"Not done","Not done","Not done","Not done","Not done","Not done","Not done",null,null,null,null,"Loxone Folder Set","Loxone Brochure (25 pcs)","Loxone Brochure (25 pcs)","Loxone Brochure (25 pcs)","Catálogo Loxone","Loxone brožurka - 25 kusů","Loxone Folder Set","Loxone Folder Set","Loxone brožurka - 25 kusů","Loxone Brochure NL (25 pcs)","not translated yet","not translated yet","not translated yet","not translated yet","not translated yet","not translated yet","not translated yet",null,null,null,null,null,3,0.5,5,3,3,85,3,4.58,3,3,"Not done","Not done","Not done","Not done","Not done","Not done","Not done"]
[200191.0,"Elektr.Schlüssel Leser Outdoor",28.0,null,null,200191.0,"iButton Reader 1-Wire Outdoor",23.75,null,null,200191.0,"iButton Reader 1-Wire Outdoor",38.0,null,null,200191.0,"Lecteur iButton extérieur",28.0,null,null,200191.0,"Lector de llaves iReader exterior",28.0,null,null,200191.0,"čtečka elektronického klíče - nerez",779.0,null,null,200191.0,"Lettore chiave elettronica outdoor",28.0,null,null,200191.0,"Elektr.Schlüssel Leser Outdoor",33.29,null,null,200191.0,"čtečka elektronického klíče - nerez",28.0,null,null,200191.0,"iButton Elec. Sleutel 1-Wire Outdoor",28.0,null,null,"Not done","not translated yet","Not done",null,null,"Not done","not translated yet","Not done",null,"Not done","not translated yet","Not done",null,null,"Not done","not translated yet","Not done",null,null,"Not done","not translated yet","Not done",null,null,"Not done","not translated yet","Not done",null,null,"Not done","not translated yet","Not done",null,null,null,null,null,null,null,null,134.0,200191,200191,200191,200191,200191,200191,200191,200191,200191,200191,"Not done","Not done","Not done","Not done","Not done","Not done","Not done",null,null,null,null,"Elektr.Schlüssel Leser Outdoor","iButton Reader 1-Wire Outdoor","iButton Reader 1-Wire Outdoor","Lecteur iButton extérieur","Lector de llaves iReader exterior","čtečka elektronického klíče - nerez","Lettore chiave elettronica outdoor","Elektr.Schlüssel Leser Outdoor","čtečka elektronického klíče - nerez","iButton Elec. Sleutel 1-Wire Outdoor","not translated yet","not translated yet","not translated yet","not translated yet","not translated yet","not translated yet","not translated yet",null,null,null,null,null,28,23.75,38,28,28,779,28,33.29,28,28,"Not done","Not done","Not done","Not done","Not done","Not done","Not done"]
[200207.0,"KEBA KeContakt P20 Wallbox",960.0,null,null,200207.0,"Keba KeContact P20 Wallbox",812.5,null,null,"not available in this country","not available in this country",0.0,null,null,200207.0,"Keba KeContact P20 Wallbox",960.0,null,null,200207.0,"KEBA KeContakt P20 Wallbox",960.0,null,null,200207.0,"Keba KeContact P20 Wallbox",22999.0,null,null,200207.0,"KEBA KeContakt P20 Wallbox",960.0,null,null,200207.0,"KEBA KeContakt P20 Wallbox",1063.89,null,null,200207.0,"Keba KeContact P20 Wallbox",960.0,null,null,200207.0,"Keba KeContact P20 Wallbox",960.0,null,null,"Not done","not translated yet","Not done",null,null,"Not done","not translated yet","Not done",null,"Not done","not translated yet","Not done",null,null,"Not done","not translated yet","Not done",null,null,"Not done","not translated yet","Not done",null,null,"Not done","not translated yet","Not done",null,null,"Not done","not translated yet","Not done",null,null,null,null,null,null,null,null,135.0,200207,200207,"not available in this country",200207,200207,200207,200207,200207,200207,200207,"Not done","Not done","Not done","Not done","Not done","Not done","Not done",null,null,null,null,"KEBA KeContakt P20 Wallbox","Keba KeContact P20 Wallbox","not available in this country","Keba KeContact P20 Wallbox","KEBA KeContakt P20 Wallbox","Keba KeContact P20 Wallbox","KEBA KeContakt P20 Wallbox","KEBA KeContakt P20 Wallbox","Keba KeContact P20 Wallbox","Keba KeContact P20 Wallbox","not translated yet","not translated yet","not translated yet","not translated yet","not translated yet","not translated yet","not translated yet",null,null,null,null,null,960,812.5,0,960,960,22999,960,1063.89,960,960,"Not done","Not done","Not done","Not done","Not done","Not done","Not done"]
[200202.0,"Loxone Speaker Einbaubox abgehängte Decken",36.0,null,null,200202.0,"Loxone Speaker Back Box For Suspended Ceilings",30.0,null,null,200202.0,"Loxone Speaker Back Box For Suspended Ceilings",39.0,null,null,200202.0,"Loxone Speaker Back Box pour faux plafond",36.0,null,null,200202.0,"Caja de empotrar falso techo Loxone Speaker",36.0,null,null,200202.0,"Loxone Speaker back box pro snížené stropy",999.0,null,null,200202.0,"Loxone Speaker box incasso controsoffitti",36.0,null,null,200202.0,"Loxone Speaker Einbaubox abgehängte Decken",46.25,null,null,200202.0,"Loxone Speaker back box pro snížené stropy",36.0,null,null,200202.0,"Loxone Speaker Inbouwdoos voor vals plafond",36.0,null,null,"Not done","not translated yet","Not done",null,null,"Not done","not translated yet","Not done",null,"Not done","not translated yet","Not done",null,null,"Not done","not translated yet","Not done",null,null,"Not done","not translated yet","Not done",null,null,"Not done","not translated yet","Not done",null,null,"Not done","not translated yet","Not done",null,null,null,null,null,null,null,null,136.0,200202,200202,200202,200202,200202,200202,200202,200202,200202,200202,"Not done","Not done","Not done","Not done","Not done","Not done","Not done",null,null,null,null,"Loxone Speaker Einbaubox abgehängte Decken","Loxone Speaker Back Box For Suspended Ceilings","Loxone Speaker Back Box For Suspended Ceilings","Loxone Speaker Back Box pour faux plafond","Caja de empotrar falso techo Loxone Speaker","Loxone Speaker back box pro snížené stropy","Loxone Speaker box incasso controsoffitti","Loxone Speaker Einbaubox abgehängte Decken","Loxone Speaker back box pro snížené stropy","Loxone Speaker Inbouwdoos voor vals plafond","not translated yet","not translated yet","not translated yet","not translated yet","not translated yet","not translated yet","not translated yet",null,null,null,null,null,36,30,39,36,36,999,36,46.25,36,36,"Not done","Not done","Not done","Not done","Not done","Not done","Not done"]
[200280.0,"LED Streifen Zubehör-Set RGBW",17.0,null,null,200280.0,"LED Strip Accessories Set - RGBW",14.0,null,null,200280.0,"LED Strip Accessories Set - RGBW",19.0,null,null,200280.0,"Kit accessoires Ruban Led RGBW",17.0,null,null,200280.0,"Kit de accesorios para tiras LED RGBW",17.0,null,null,200280.0,"Příslušenství k LED páskům - set RGBW",449.0,null,null,200280.0,"Strisce LED set accessorio RGBW",17.0,null,null,200280.0,"LED Streifen Zubehör-Set RGBW",21.25,null,null,200280.0,"Příslušenství k LED páskům - set RGBW",17.0,null,null,200280.0,"LED Strip toebehoren Set - RGBW",17.0,null,null,"Not done","not translated yet","Not done",null,null,"Not done","not translated yet","Not done",null,"Not done","not translated yet","Not done",null,null,"Not done","not translated yet","Not done",null,null,"Not done","not translated yet","Not done",null,null,"Not done","not translated yet","Not done",null,null,"Not done","not translated yet","Not done",null,null,null,null,null,null,null,null,137.0,200280,200280,200280,200280,200280,200280,200280,200280,200280,200280,"Not done","Not done","Not done","Not done","Not done","Not done","Not done",null,null,null,null,"LED Streifen Zubehör-Set RGBW","LED Strip Accessories Set - RGBW","LED Strip Accessories Set - RGBW","Kit accessoires Ruban Led RGBW","Kit de accesorios para tiras LED RGBW","Příslušenství k LED páskům - set RGBW","Strisce LED set accessorio RGBW","LED Streifen Zubehör-Set RGBW","Příslušenství k LED páskům - set RGBW","LED Strip toebehoren Set - RGBW","not translated yet","not translated yet","not translated yet","not translated yet","not translated yet","not translated yet","not translated yet",null,null,null,null,null,17,14,19,17,17,449,17,21.25,17,17,"Not done","Not done","Not done","Not done","Not done","Not done","Not done"]
[200278.0,"LED Streifen Zubehör-Set WW",12.0,null,null,200278.0,"LED Strip Accessories Set - Warm White",10.0,null,null,200278.0,"LED Strip Accessories Set - Warm White",14.0,null,null,200278.0,"Kit accessoires Ruban Led blanc",12.0,null,null,200278.0,"Kit de accesorios para tiras LED WW",12.0,null,null,200278.0,"Příslušenství k LED páskům - set WW",325.0,null,null,200278.0,"Strisce LED set accessorio WW",12.0,null,null,200278.0,"LED Streifen Zubehör-Set WW",12.0,null,null,200278.0,"Příslušenství k LED páskům - set WW",12.0,null,null,200278.0,"LED Strip toebehoren Set - Warm Wit",12.0,null,null,"Not done","not translated yet","Not done",null,null,"Not done","not translated yet","Not done",null,"Not done","not translated yet","Not done",null,null,"Not done","not translated yet","Not done",null,null,"Not done","not translated yet","Not done",null,null,"Not done","not translated yet","Not done",null,null,"Not done","not translated yet","Not done",null,null,null,null,null,null,null,null,138.0,200278,200278,200278,200278,200278,200278,200278,200278,200278,200278,"Not done","Not done","Not done","Not done","Not done","Not done","Not done",null,null,null,null,"LED Streifen Zubehör-Set WW","LED Strip Accessories Set - Warm White","LED Strip Accessories Set - Warm White","Kit accessoires Ruban Led blanc","Kit de accesorios para tiras LED WW","Příslušenství k LED páskům - set WW","Strisce LED set accessorio WW","LED Streifen Zubehör-Set WW","Příslušenství k LED páskům - set WW","LED Strip toebehoren Set - Warm Wit","not translated yet","not translated yet","not translated yet","not translated yet","not translated yet","not translated yet","not translated yet",null,null,null,null,null,12,10,14,12,12,325,12,12,12,12,"Not done","Not done","Not done","Not done","Not done","Not done","Not done"]
[200161.0,"Steckernetzteil 24V, 6,25A",65.0,null,null,200161.0,"Power Adapter 24V 6.25A",57.5,null,null,200161.0,"Power Adapter 24V 6.25A",84.9,null,null,200161.0,"Alimentation transfo 24V 6.25A",65.0,null,null,200161.0,"Fuente de alimentación 24V, 6,25A",65.0,null,null,200161.0,"Napájecí zdroj do zásuvky 24V, 6,25A Typ E,F",1799.0,null,null,200161.0,"Alimentatore a presa 24V 6,25A",65.0,null,null,200286.0,"Steckernetzteil 24V, 6,25A",83.29,null,null,200161.0,"Napájecí zdroj do zásuvky 24V, 6,25A Typ E,F",65.0,null,null,200161.0,"Voeding 24V 6.25A",65.0,null,null,"Not done","not translated yet","Not done",null,null,"Not done","not translated yet","Not done",null,"Not done","not translated yet","Not done",null,null,"Not done","not translated yet","Not done",null,null,"Not done","not translated yet","Not done",null,null,"Not done","not translated yet","Not done",null,null,"Not done","not translated yet","Not done",null,null,null,null,null,null,null,null,139.0,200161,200161,200161,200161,200161,200161,200161,200286,200161,200161,"Not done","Not done","Not done","Not done","Not done","Not done","Not done",null,null,null,null,"Steckernetzteil 24V, 6,25A","Power Adapter 24V 6.25A","Power Adapter 24V 6.25A","Alimentation transfo 24V 6.25A","Fuente de alimentación 24V, 6,25A","Napájecí zdroj do zásuvky 24V, 6,25A Typ E,F","Alimentatore a presa 24V 6,25A","Steckernetzteil 24V, 6,25A","Napájecí zdroj do zásuvky 24V, 6,25A Typ E,F","Voeding 24V 6.25A","not translated yet","not translated yet","not translated yet","not translated yet","not translated yet","not translated yet","not translated yet",null,null,null,null,null,65,57.5,84.9,65,65,1799,65,83.29,65,65,"Not done","Not done","Not done","Not done","Not done","Not done","Not done"]
[100205.0,"Loxone Music Server Upgrade",99.0,null,null,100205.0,"Loxone Music Server Upgrade",80.0,null,null,100205.0,"Loxone Music Server Upgrade",140.09,null,null,100205.0,"Loxone Music Server Mise à niveau",99.0,null,null,100205.0,"Actualización Loxone Music Server",99.0,null,null,100205.0,"Loxone Music Server Upgrade",2699.0,null,null,100205.0,"Loxone Music Server Upgrade",99.0,null,null,100205.0,"Loxone Music Server Upgrade",119.44,null,null,100205.0,"Loxone Music Server Upgrade",99.0,null,null,100205.0,"Loxone Music Server Upgrade",99.0,null,null,"Not done","not translated yet","Not done",null,null,"Not done","not translated yet","Not done",null,"Not done","not translated yet","Not done",null,null,"Not done","not translated yet","Not done",null,null,"Not done","not translated yet","Not done",null,null,"Not done","not translated yet","Not done",null,null,"Not done","not translated yet","Not done",null,null,null,null,null,null,null,null,140.0,100205,100205,100205,100205,100205,100205,100205,100205,100205,100205,"Not done","Not done","Not done","Not done","Not done","Not done","Not done",null,null,null,null,"Loxone Music Server Upgrade","Loxone Music Server Upgrade","Loxone Music Server Upgrade","Loxone Music Server Mise à niveau","Actualización Loxone Music Server","Loxone Music Server Upgrade","Loxone Music Server Upgrade","Loxone Music Server Upgrade","Loxone Music Server Upgrade","Loxone Music Server Upgrade","not translated yet","not translated yet","not translated yet","not translated yet","not translated yet","not translated yet","not translated yet",null,null,null,null,null,99,80,140.09,99,99,2699,99,119.44,99,99,"Not done","Not done","Not done","Not done","Not done","Not done","Not done"]
[200273.0,"Loxone Intercom XL",1150.0,null,null,200274.0,"Loxone Intercom XL",975.0,null,null,200274.0,"Loxone Intercom XL",1269.0,null,null,200274.0,"Intercom XL",1150.0,null,null,200273.0,"Loxone Intercom XL",1150.0,null,null,200273.0,"Loxone Intercom XL",31499.0,null,null,200273.0,"Loxone Intercom XL",1150.0,null,null,200192.0,"Loxone Intercom XL",1480.56,null,null,200273.0,"Loxone Intercom XL",1150.0,null,null,200273.0,"Loxone Intercom XL",1150.0,null,null,"Not done","not translated yet","Not done",null,null,"Not done","not translated yet","Not done",null,"Not done","not translated yet","Not done",null,null,"Not done","not translated yet","Not done",null,null,"Not done","not translated yet","Not done",null,null,"Not done","not translated yet","Not done",null,null,"Not done","not translated yet","Not done",null,null,null,null,null,null,null,null,141.0,200273,200274,200274,200274,200273,200273,200273,200192,200273,200273,"Not done","Not done","Not done","Not done","Not done","Not done","Not done",null,null,null,null,"Loxone Intercom XL","Loxone Intercom XL","Loxone Intercom XL","Intercom XL","Loxone Intercom XL","Loxone Intercom XL","Loxone Intercom XL","Loxone Intercom XL","Loxone Intercom XL","Loxone Intercom XL","not translated yet","not translated yet","not translated yet","not translated yet","not translated yet","not translated yet","not translated yet",null,null,null,null,null,1150,975,1269,1150,1150,31499,1150,1480.56,1150,1150,"Not done","Not done","Not done","Not done","Not done","Not done","Not done"]
[100190.0,"Bewegungsmelder Air",83.25,null,null,100190.0,"Motion Sensor Air",64.8,null,null,100190.0,"Motion Sensor Air",95.0,null,null,100190.0,"Détecteur de présence Air blanc",83.25,null,null,100190.0,"Detector de movimiento Air",83.25,null,null,100190.0,"Pohybový senzor Air",2249.0,null,null,100190.0,"Sensore di movimento Air",83.25,null,null,100190.0,"Bewegungsmelder Air",100.93,null,null,100190.0,"Pohybový senzor Air",83.25,null,null,100190.0,"Bewegingsmelder Air",83.25,null,null,"Not done","not translated yet","Not done",null,null,"Not done","not translated yet","Not done",null,"Not done","not translated yet","Not done",null,null,"Not done","not translated yet","Not done",null,null,"Not done","not translated yet","Not done",null,null,"Not done","not translated yet","Not done",null,null,"Not done","not translated yet","Not done",null,null,null,null,null,null,null,null,142.0,100190,100190,100190,100190,100190,100190,100190,100190,100190,100190,"Not done","Not done","Not done","Not done","Not done","Not done","Not done",null,null,null,null,"Bewegungsmelder Air","Motion Sensor Air","Motion Sensor Air","Détecteur de présence Air blanc","Detector de movimiento Air","Pohybový senzor Air","Sensore di movimento Air","Bewegungsmelder Air","Pohybový senzor Air","Bewegingsmelder Air","not translated yet","not translated yet","not translated yet","not translated yet","not translated yet","not translated yet","not translated yet",null,null,null,null,null,83.25,64.8,95,83.25,83.25,2249,83.25,100.93,83.25,83.25,"Not done","Not done","Not done","Not done","Not done","Not done","Not done"]
[200281.0,"NFC Smart Tags (25 Stk.)",23.0,null,null,200281.0,"NFC Smart Tags",18.75,null,null,200281.0,"NFC Smart Tags",26.0,null,null,200281.0,"NFC Smart Tags",23.0,null,null,200281.0,"NFC Smart Tags",23.0,null,null,200281.0,"NFC Smart tagy",629.0,null,null,200281.0,"NFC Smart Tags (25 pz.)",23.0,null,null,200281.0,"NFC Smart Tags (25 Stk.)",29.58,null,null,200281.0,"NFC Smart tagy",23.0,null,null,200281.0,"NFC Smart Tags",23.0,null,null,"Not done","not translated yet","Not done",null,null,"Not done","not translated yet","Not done",null,"Not done","not translated yet","Not done",null,null,"Not done","not translated yet","Not done",null,null,"Not done","not translated yet","Not done",null,null,"Not done","not translated yet","Not done",null,null,"Not done","not translated yet","Not done",null,null,null,null,null,null,null,null,143.0,200281,200281,200281,200281,200281,200281,200281,200281,200281,200281,"Not done","Not done","Not done","Not done","Not done","Not done","Not done",null,null,null,null,"NFC Smart Tags (25 Stk.)","NFC Smart Tags","NFC Smart Tags","NFC Smart Tags","NFC Smart Tags","NFC Smart tagy","NFC Smart Tags (25 pz.)","NFC Smart Tags (25 Stk.)","NFC Smart tagy","NFC Smart Tags","not translated yet","not translated yet","not translated yet","not translated yet","not translated yet","not translated yet","not translated yet",null,null,null,null,null,23,18.75,26,23,23,629,23,29.58,23,23,"Not done","Not done","Not done","Not done","Not done","Not done","Not done"]
[100204.0,"LED Spot RGBW",49.92,null,null,100204.0,"LED Spot RGBW",37.5,null,null,100204.0,"LED Spot RGBW",55.0,null,null,100204.0,"Spot Led RGBW",49.92,null,null,100204.0,"Led Spot RGBW",49.92,null,null,100204.0,"LED Spot RGBW",1349.0,null,null,100204.0,"LED Spot RGBW",49.92,null,null,100204.0,"LED Spot RGBW",60.14,null,null,100204.0,"LED Spot RGBW",49.92,null,null,100204.0,"LED Spot RGBW",49.92,null,null,"Not done","not translated yet","Not done",null,null,"Not done","not translated yet","Not done",null,"Not done","not translated yet","Not done",null,null,"Not done","not translated yet","Not done",null,null,"Not done","not translated yet","Not done",null,null,"Not done","not translated yet","Not done",null,null,"Not done","not translated yet","Not done",null,null,null,null,null,null,null,null,144.0,100204,100204,100204,100204,100204,100204,100204,100204,100204,100204,"Not done","Not done","Not done","Not done","Not done","Not done","Not done",null,null,null,null,"LED Spot RGBW","LED Spot RGBW","LED Spot RGBW","Spot Led RGBW","Led Spot RGBW","LED Spot RGBW","LED Spot RGBW","LED Spot RGBW","LED Spot RGBW","LED Spot RGBW","not translated yet","not translated yet","not translated yet","not translated yet","not translated yet","not translated yet","not translated yet",null,null,null,null,null,49.92,37.5,55,49.92,49.92,1349,49.92,60.14,49.92,49.92,"Not done","Not done","Not done","Not done","Not done","Not done","Not done"]
[100203.0,"LED Spot WW",33.25,null,null,100203.0,"LED Spot Warm White",25.0,null,null,100203.0,"LED Spot Warm White",39.0,null,null,100203.0,"Spot Led blanc chaud",33.25,null,null,100203.0,"Led Spot WW",33.25,null,null,100203.0,"LED Spot WW",899.0,null,null,100203.0,"LED Spot WW",33.25,null,null,100203.0,"LED Spot WW",40.69,null,null,100203.0,"LED Spot WW",33.25,null,null,100203.0,"LED Spot Warm Wit",33.25,null,null,"Not done","not translated yet","Not done",null,null,"Not done","not translated yet","Not done",null,"Not done","not translated yet","Not done",null,null,"Not done","not translated yet","Not done",null,null,"Not done","not translated yet","Not done",null,null,"Not done","not translated yet","Not done",null,null,"Not done","not translated yet","Not done",null,null,null,null,null,null,null,null,145.0,100203,100203,100203,100203,100203,100203,100203,100203,100203,100203,"Not done","Not done","Not done","Not done","Not done","Not done","Not done",null,null,null,null,"LED Spot WW","LED Spot Warm White","LED Spot Warm White","Spot Led blanc chaud","Led Spot WW","LED Spot WW","LED Spot WW","LED Spot WW","LED Spot WW","LED Spot Warm Wit","not translated yet","not translated yet","not translated yet","not translated yet","not translated yet","not translated yet","not translated yet",null,null,null,null,null,33.25,25,39,33.25,33.25,899,33.25,40.69,33.25,33.25,"Not done","Not done","Not done","Not done","Not done","Not done","Not done"]
[200294.0,"Elektroauto Ladebkabel Typ 2",319.0,null,null,200294.0,"Electric Car Charging Cable Type 2",252.0,null,null,"not available in this country","not available in this country",0.0,null,null,200294.0,"Câble de recharge pour voiture électriques Type 2",319.0,null,null,200294.0,"Cable de carga del coche eléctrico Tipo 2",319.0,null,null,200294.0,"Nabíjecí kabel typ 2",8599.0,null,null,200294.0,"Cavo di carico auto elettrica tipo 2",319.0,null,null,200294.0,"Elektroauto Ladebkabel Typ 2",387.96,null,null,200294.0,"Nabíjecí kabel typ 2",319.0,null,null,200294.0,"Electrische auto laadkabel Type 2",319.0,null,null,"Not done","not translated yet","Not done",null,null,"Not done","not translated yet","Not done",null,"Not done","not translated yet","Not done",null,null,"Not done","not translated yet","Not done",null,null,"Not done","not translated yet","Not done",null,null,"Not done","not translated yet","Not done",null,null,"Not done","not translated yet","Not done",null,null,null,null,null,null,null,null,146.0,200294,200294,"not available in this country",200294,200294,200294,200294,200294,200294,200294,"Not done","Not done","Not done","Not done","Not done","Not done","Not done",null,null,null,null,"Elektroauto Ladebkabel Typ 2","Electric Car Charging Cable Type 2","not available in this country","Câble de recharge pour voiture électriques Type 2","Cable de carga del coche eléctrico Tipo 2","Nabíjecí kabel typ 2","Cavo di carico auto elettrica tipo 2","Elektroauto Ladebkabel Typ 2","Nabíjecí kabel typ 2","Electrische auto laadkabel Type 2","not translated yet","not translated yet","not translated yet","not translated yet","not translated yet","not translated yet","not translated yet",null,null,null,null,null,319,252,0,319,319,8599,319,387.96,319,319,"Not done","Not done","Not done","Not done","Not done","Not done","Not done"]
[100218.0,"Tree Extension",82.5,null,null,100218.0,"Tree Extension",72.5,null,null,100218.0,"Tree Extension",99.0,null,null,100218.0,"Extension Tree",82.5,null,null,100218.0,"Tree Extension",82.5,null,null,100218.0,"Tree Extension",2099.0,null,null,100218.0,"Tree Extension",82.5,null,null,100218.0,"Tree Extension",110.19,null,null,100218.0,"Tree Extension",82.5,null,null,100218.0,"Tree Extension",82.5,null,null,"Not done","not translated yet","Not done",null,null,"Not done","not translated yet","Not done",null,"Not done","not translated yet","Not done",null,null,"Not done","not translated yet","Not done",null,null,"Not done","not translated yet","Not done",null,null,"Not done","not translated yet","Not done",null,null,"Not done","not translated yet","Not done",null,null,null,null,null,null,null,null,147.0,100218,100218,100218,100218,100218,100218,100218,100218,100218,100218,"Not done","Not done","Not done","Not done","Not done","Not done","Not done",null,null,null,null,"Tree Extension","Tree Extension","Tree Extension","Extension Tree","Tree Extension","Tree Extension","Tree Extension","Tree Extension","Tree Extension","Tree Extension","not translated yet","not translated yet","not translated yet","not translated yet","not translated yet","not translated yet","not translated yet",null,null,null,null,null,82.5,72.5,99,82.5,82.5,2099,82.5,110.19,82.5,82.5,"Not done","Not done","Not done","Not done","Not done","Not done","Not done"]
[100221.0,"Touch Tree Weiß",69.0,null,null,100221.0,"Touch Tree White",57.5,null,null,100221.0,"Touch Tree White",79.0,null,null,100221.0,"Touch Tree Blanc",69.0,null,null,100221.0,"Touch Tree Blanco",69.0,null,null,100221.0,"Touch Tree bílá",1849.0,null,null,100221.0,"Touch Tree bianco",69.0,null,null,100221.0,"Touch Tree Weiß",89.77,null,null,100221.0,"Touch Tree bílá",64.5,null,null,100221.0,"Touch Tree Wit",69.0,null,null,"Not done","not translated yet","Not done",null,null,"Not done","not translated yet","Not done",null,"Not done","not translated yet","Not done",null,null,"Not done","not translated yet","Not done",null,null,"Not done","not translated yet","Not done",null,null,"Not done","not translated yet","Not done",null,null,"Not done","not translated yet","Not done",null,null,null,null,null,null,null,null,148.0,100221,100221,100221,100221,100221,100221,100221,100221,100221,100221,"Not done","Not done","Not done","Not done","Not done","Not done","Not done",null,null,null,null,"Touch Tree Weiß","Touch Tree White","Touch Tree White","Touch Tree Blanc","Touch Tree Blanco","Touch Tree bílá","Touch Tree bianco","Touch Tree Weiß","Touch Tree bílá","Touch Tree Wit","not translated yet","not translated yet","not translated yet","not translated yet","not translated yet","not translated yet","not translated yet",null,null,null,null,null,69,57.5,79,69,69,1849,69,89.77,64.5,69,"Not done","Not done","Not done","Not done","Not done","Not done","Not done"]
[100222.0,"Touch Tree Anthrazit",69.0,null,null,100222.0,"Touch Tree Anthracite",57.5,null,null,100222.0,"Touch Tree Black",79.0,null,null,100222.0,"Touch Tree Anthracite",69.0,null,null,100222.0,"Touch Tree Antracita",69.0,null,null,100222.0,"Touch Tree anthrazit",1849.0,null,null,100222.0,"Touch Tree antracite",69.0,null,null,100222.0,"Touch Tree Anthrazit",89.77,null,null,100222.0,"Touch Tree anthrazit",64.5,null,null,100222.0,"Touch Tree Anthraciet",69.0,null,null,"Not done","not translated yet","Not done",null,null,"Not done","not translated yet","Not done",null,"Not done","not translated yet","Not done",null,null,"Not done","not translated yet","Not done",null,null,"Not done","not translated yet","Not done",null,null,"Not done","not translated yet","Not done",null,null,"Not done","not translated yet","Not done",null,null,null,null,null,null,null,null,149.0,100222,100222,100222,100222,100222,100222,100222,100222,100222,100222,"Not done","Not done","Not done","Not done","Not done","Not done","Not done",null,null,null,null,"Touch Tree Anthrazit","Touch Tree Anthracite","Touch Tree Black","Touch Tree Anthracite","Touch Tree Antracita","Touch Tree anthrazit","Touch Tree antracite","Touch Tree Anthrazit","Touch Tree anthrazit","Touch Tree Anthraciet","not translated yet","not translated yet","not translated yet","not translated yet","not translated yet","not translated yet","not translated yet",null,null,null,null,null,69,57.5,79,69,69,1849,69,89.77,64.5,69,"Not done","Not done","Not done","Not done","Not done","Not done","Not done"]
[100223.0,"Bewegungsmelder Tree Weiß",74.5,null,null,100223.0,"Motion Sensor Tree White",60.0,null,null,100223.0,"Motion Sensor Tree White",86.0,null,null,100223.0,"Détecteur de mouvement Tree blanc",74.5,null,null,100223.0,"Detector de movimiento Tree",74.5,null,null,100223.0,"Motion Sensor Tree bilá",1999.0,null,null,100223.0,"Sensore di movimento Tree bianco",74.5,null,null,100223.0,"Bewegungsmelder Tree Weiß",92.55,null,null,100223.0,"Motion Sensor Tree bilá",74.5,null,null,100223.0,"Bewegingsmelder Tree",74.5,null,null,"Not done","not translated yet","Not done",null,null,"Not done","not translated yet","Not done",null,"Not done","not translated yet","Not done",null,null,"Not done","not translated yet","Not done",null,null,"Not done","not translated yet","Not done",null,null,"Not done","not translated yet","Not done",null,null,"Not done","not translated yet","Not done",null,null,null,null,null,null,null,null,150.0,100223,100223,100223,100223,100223,100223,100223,100223,100223,100223,"Not done","Not done","Not done","Not done","Not done","Not done","Not done",null,null,null,null,"Bewegungsmelder Tree Weiß","Motion Sensor Tree White","Motion Sensor Tree White","Détecteur de mouvement Tree blanc","Detector de movimiento Tree","Motion Sensor Tree bilá","Sensore di movimento Tree bianco","Bewegungsmelder Tree Weiß","Motion Sensor Tree bilá","Bewegingsmelder Tree","not translated yet","not translated yet","not translated yet","not translated yet","not translated yet","not translated yet","not translated yet",null,null,null,null,null,74.5,60,86,74.5,74.5,1999,74.5,92.55,74.5,74.5,"Not done","Not done","Not done","Not done","Not done","Not done","Not done"]
[100225.0,"Stellantrieb Tree",65.5,null,null,100225.0,"Valve Actuator Tree",52.5,null,null,100225.0,"Valve Actuator Tree",76.0,null,null,100225.0,"Tête thermostatique Tree",65.5,null,null,100225.0,"Actuador Válvula Tree",65.5,null,null,100225.0,"Hlavice Tree",1749.0,null,null,100225.0,"Valvola termica Tree",65.5,null,null,100225.0,"Stellantrieb Tree",83.29,null,null,100225.0,"Hlavice Tree",65.5,null,null,100225.0,"Stelventiel Tree",65.5,null,null,"Not done","not translated yet","Not done",null,null,"Not done","not translated yet","Not done",null,"Not done","not translated yet","Not done",null,null,"Not done","not translated yet","Not done",null,null,"Not done","not translated yet","Not done",null,null,"Not done","not translated yet","Not done",null,null,"Not done","not translated yet","Not done",null,null,null,null,null,null,null,null,151.0,100225,100225,100225,100225,100225,100225,100225,100225,100225,100225,"Not done","Not done","Not done","Not done","Not done","Not done","Not done",null,null,null,null,"Stellantrieb Tree","Valve Actuator Tree","Valve Actuator Tree","Tête thermostatique Tree","Actuador Válvula Tree","Hlavice Tree","Valvola termica Tree","Stellantrieb Tree","Hlavice Tree","Stelventiel Tree","not translated yet","not translated yet","not translated yet","not translated yet","not translated yet","not translated yet","not translated yet",null,null,null,null,null,65.5,52.5,76,65.5,65.5,1749,65.5,83.29,65.5,65.5,"Not done","Not done","Not done","Not done","Not done","Not done","Not done"]
[100211.0,"Wassersensor Air",54.0,null,null,100211.0,"Water Sensor Air",42.5,null,null,100211.0,"Water Sensor Air",59.0,null,null,100211.0,"Capteur d'inondation Air",54.0,null,null,100211.0,"Sensor inundación Air",54.0,null,null,100211.0,"Záplavový senzor Air",1449.0,null,null,100211.0,"Sensore acqua Air",54.0,null,null,100211.0,"Wassersensor Air",64.77,null,null,100211.0,"Záplavový senzor Air",54.0,null,null,100211.0,"Waterrsensor Air",54.0,null,null,"Not done","not translated yet","Not done",null,null,"Not done","not translated yet","Not done",null,"Not done","not translated yet","Not done",null,null,"Not done","not translated yet","Not done",null,null,"Not done","not translated yet","Not done",null,null,"Not done","not translated yet","Not done",null,null,"Not done","not translated yet","Not done",null,null,null,null,null,null,null,null,152.0,100211,100211,100211,100211,100211,100211,100211,100211,100211,100211,"Not done","Not done","Not done","Not done","Not done","Not done","Not done",null,null,null,null,"Wassersensor Air","Water Sensor Air","Water Sensor Air","Capteur d'inondation Air","Sensor inundación Air","Záplavový senzor Air","Sensore acqua Air","Wassersensor Air","Záplavový senzor Air","Waterrsensor Air","not translated yet","not translated yet","not translated yet","not translated yet","not translated yet","not translated yet","not translated yet",null,null,null,null,null,54,42.5,59,54,54,1449,54,64.77,54,54,"Not done","Not done","Not done","Not done","Not done","Not done","Not done"]
[100213.0,"Tür- & Fensterkontakt Air Anthrazit",54.0,null,null,100213.0,"Door & Window Contact Air Anthracite",42.5,null,null,100213.0,"Door & Window Contact Air Black",59.0,null,null,100213.0,"Contact d'ouverture Air Anthracite",54.0,null,null,100213.0,"Contacto de puerta y ventana Air Antracita",54.0,null,null,100213.0,"Okenní a dveřní kontakt Air anthrazit",1449.0,null,null,100213.0,"Contatto finestra e porta Air antracite",54.0,null,null,100213.0,"Tür- & Fensterkontakt Air Anthrazit",64.77,null,null,100213.0,"Okenní a dveřní kontakt Air anthrazit",54.0,null,null,100213.0,"Raam- & Deurcontact Air Anthraciet",54.0,null,null,"Not done","not translated yet","Not done",null,null,"Not done","not translated yet","Not done",null,"Not done","not translated yet","Not done",null,null,"Not done","not translated yet","Not done",null,null,"Not done","not translated yet","Not done",null,null,"Not done","not translated yet","Not done",null,null,"Not done","not translated yet","Not done",null,null,null,null,null,null,null,null,153.0,100213,100213,100213,100213,100213,100213,100213,100213,100213,100213,"Not done","Not done","Not done","Not done","Not done","Not done","Not done",null,null,null,null,"Tür- & Fensterkontakt Air Anthrazit","Door & Window Contact Air Anthracite","Door & Window Contact Air Black","Contact d'ouverture Air Anthracite","Contacto de puerta y ventana Air Antracita","Okenní a dveřní kontakt Air anthrazit","Contatto finestra e porta Air antracite","Tür- & Fensterkontakt Air Anthrazit","Okenní a dveřní kontakt Air anthrazit","Raam- & Deurcontact Air Anthraciet","not translated yet","not translated yet","not translated yet","not translated yet","not translated yet","not translated yet","not translated yet",null,null,null,null,null,54,42.5,59,54,54,1449,54,64.77,54,54,"Not done","Not done","Not done","Not done","Not done","Not done","Not done"]
[100210.0,"Tür- & Fensterkontakt Air Weiß",54.0,null,null,100210.0,"Door & Window Contact Air White",42.5,null,null,100210.0,"Door & Window Contact Air White",59.0,null,null,100210.0,"Contact d'ouverture Air Blanc",54.0,null,null,100210.0,"Contacto de puerta y ventana Air Blanco",54.0,null,null,100210.0,"Okenní a dveřní kontakt Air bílá",1449.0,null,null,100210.0,"Contatto finestra e porta Air bianco",54.0,null,null,100210.0,"Tür- & Fensterkontakt Air Weiß",64.77,null,null,100210.0,"Okenní a dveřní kontakt Air bílá",54.0,null,null,100210.0,"Raam- & Deurcontact Air Wit",54.0,null,null,"Not done","not translated yet","Not done",null,null,"Not done","not translated yet","Not done",null,"Not done","not translated yet","Not done",null,null,"Not done","not translated yet","Not done",null,null,"Not done","not translated yet","Not done",null,null,"Not done","not translated yet","Not done",null,null,"Not done","not translated yet","Not done",null,null,null,null,null,null,null,null,154.0,100210,100210,100210,100210,100210,100210,100210,100210,100210,100210,"Not done","Not done","Not done","Not done","Not done","Not done","Not done",null,null,null,null,"Tür- & Fensterkontakt Air Weiß","Door & Window Contact Air White","Door & Window Contact Air White","Contact d'ouverture Air Blanc","Contacto de puerta y ventana Air Blanco","Okenní a dveřní kontakt Air bílá","Contatto finestra e porta Air bianco","Tür- & Fensterkontakt Air Weiß","Okenní a dveřní kontakt Air bílá","Raam- & Deurcontact Air Wit","not translated yet","not translated yet","not translated yet","not translated yet","not translated yet","not translated yet","not translated yet",null,null,null,null,null,54,42.5,59,54,54,1449,54,64.77,54,54,"Not done","Not done","Not done","Not done","Not done","Not done","Not done"]
[100224.0,"Bewegungsmelder Tree Anthrazit",74.5,null,null,100224.0,"Motion Sensor Tree Anthracite",60.0,null,null,100224.0,"Motion Sensor Tree Black",86.0,null,null,100224.0,"Détecteur de présence Tree Anthracite",74.5,null,null,100224.0,"Detector de movimiento Tree Antracita",74.5,null,null,100224.0,"Pohybový senzor Tree anthrazit",1999.0,null,null,100224.0,"Sensore di movimento Tree antracite",74.5,null,null,100224.0,"Bewegungsmelder Tree Anthrazit",92.55,null,null,100224.0,"Pohybový senzor Tree anthrazit",74.5,null,null,100224.0,"Bewegingsmelder Tree Antraciet",74.5,null,null,"Not done","not translated yet","Not done",null,null,"Not done","not translated yet","Not done",null,"Not done","not translated yet","Not done",null,null,"Not done","not translated yet","Not done",null,null,"Not done","not translated yet","Not done",null,null,"Not done","not translated yet","Not done",null,null,"Not done","not translated yet","Not done",null,null,null,null,null,null,null,null,155.0,100224,100224,100224,100224,100224,100224,100224,100224,100224,100224,"Not done","Not done","Not done","Not done","Not done","Not done","Not done",null,null,null,null,"Bewegungsmelder Tree Anthrazit","Motion Sensor Tree Anthracite","Motion Sensor Tree Black","Détecteur de présence Tree Anthracite","Detector de movimiento Tree Antracita","Pohybový senzor Tree anthrazit","Sensore di movimento Tree antracite","Bewegungsmelder Tree Anthrazit","Pohybový senzor Tree anthrazit","Bewegingsmelder Tree Antraciet","not translated yet","not translated yet","not translated yet","not translated yet","not translated yet","not translated yet","not translated yet",null,null,null,null,null,74.5,60,86,74.5,74.5,1999,74.5,92.55,74.5,74.5,"Not done","Not done","Not done","Not done","Not done","Not done","Not done"]
[200204.0,"Querverbinder 20 Pol (20 Stk.)",88.0,null,null,200204.0,"Cross Connector for Mains Terminals (20 pcs)",75.0,null,null,200204.0,"Cross Connector for Mains Terminals (20 pcs)",96.0,null,null,200204.0,"Peigne de connexion 20 pôles",88.0,null,null,200204.0,"Conector transversal 20 polos (20 Ud.)",88.0,null,null,200204.0,"20-ti pólová propojka Weidmuller (20 ks)",2399.0,null,null,200204.0,"Collegamento trasversale 20 poli (20pz.)",88.0,null,null,200204.0,"Querverbinder 20 Pol (20 Stk.)",110.19,null,null,200204.0,"20-ti pólová propojka Weidmuller (20 ks)",88.0,null,null,200204.0,"Weidmüller dwarsverbinder 20-polig (20) stuks)",88.0,null,null,"Not done","not translated yet","Not done",null,null,"Not done","not translated yet","Not done",null,"Not done","not translated yet","Not done",null,null,"Not done","not translated yet","Not done",null,null,"Not done","not translated yet","Not done",null,null,"Not done","not translated yet","Not done",null,null,"Not done","not translated yet","Not done",null,null,null,null,null,null,null,null,156.0,200204,200204,200204,200204,200204,200204,200204,200204,200204,200204,"Not done","Not done","Not done","Not done","Not done","Not done","Not done",null,null,null,null,"Querverbinder 20 Pol (20 Stk.)","Cross Connector for Mains Terminals (20 pcs)","Cross Connector for Mains Terminals (20 pcs)","Peigne de connexion 20 pôles","Conector transversal 20 polos (20 Ud.)","20-ti pólová propojka Weidmuller (20 ks)","Collegamento trasversale 20 poli (20pz.)","Querverbinder 20 Pol (20 Stk.)","20-ti pólová propojka Weidmuller (20 ks)","Weidmüller dwarsverbinder 20-polig (20) stuks)","not translated yet","not translated yet","not translated yet","not translated yet","not translated yet","not translated yet","not translated yet",null,null,null,null,null,88,75,96,88,88,2399,88,110.19,88,88,"Not done","Not done","Not done","Not done","Not done","Not done","Not done"]
[100200.0,"Dali Extension",449.0,null,null,100200.0,"Dali Extension",372.5,null,null,100200.0,"Dali Extension",499.0,null,null,100200.0,"Extension Dali",449.0,null,null,100200.0,"Dali Extension",449.0,null,null,100200.0,"Dali Extension",12199.0,null,null,100200.0,"Dali Extension",449.0,null,null,100200.0,"Dali Extension",582.41,null,null,100200.0,"Dali Extension",449.0,null,null,100200.0,"Dali Extension",449.0,null,null,"Not done","not translated yet","Not done",null,null,"Not done","not translated yet","Not done",null,"Not done","not translated yet","Not done",null,null,"Not done","not translated yet","Not done",null,null,"Not done","not translated yet","Not done",null,null,"Not done","not translated yet","Not done",null,null,"Not done","not translated yet","Not done",null,null,null,null,null,null,null,null,157.0,100200,100200,100200,100200,100200,100200,100200,100200,100200,100200,"Not done","Not done","Not done","Not done","Not done","Not done","Not done",null,null,null,null,"Dali Extension","Dali Extension","Dali Extension","Extension Dali","Dali Extension","Dali Extension","Dali Extension","Dali Extension","Dali Extension","Dali Extension","not translated yet","not translated yet","not translated yet","not translated yet","not translated yet","not translated yet","not translated yet",null,null,null,null,null,449,372.5,499,449,449,12199,449,582.41,449,449,"Not done","Not done","Not done","Not done","Not done","Not done","Not done"]
[200297.0,"LED Schaltnetzteil 24V 2.5A",29.0,null,null,200297.0,"24V LED Power Supply (2.5A)",24.0,null,null,200297.0,"24V LED Power Supply (2.5A)",35.0,null,null,200297.0,"Alimentation MeanWell 24V; 2,5A",29.0,null,null,200297.0,"Fuente de alimentación LED 24V 2.5A",29.0,null,null,200297.0,"Spínaný LED zdroj 24V 2,5A",799.0,null,null,200297.0,"Alimentatore LED 24V 2,5A",29.0,null,null,200297.0,"LED Schaltnetzteil 24V 2.5A",36.99,null,null,200297.0,"Spínaný LED zdroj 24V 2,5A",29.0,null,null,200297.0,"Led voeding 24V, 2,5 A",29.0,null,null,"Not done","not translated yet","Not done",null,null,"Not done","not translated yet","Not done",null,"Not done","not translated yet","Not done",null,null,"Not done","not translated yet","Not done",null,null,"Not done","not translated yet","Not done",null,null,"Not done","not translated yet","Not done",null,null,"Not done","not translated yet","Not done",null,null,null,null,null,null,null,null,158.0,200297,200297,200297,200297,200297,200297,200297,200297,200297,200297,"Not done","Not done","Not done","Not done","Not done","Not done","Not done",null,null,null,null,"LED Schaltnetzteil 24V 2.5A","24V LED Power Supply (2.5A)","24V LED Power Supply (2.5A)","Alimentation MeanWell 24V; 2,5A","Fuente de alimentación LED 24V 2.5A","Spínaný LED zdroj 24V 2,5A","Alimentatore LED 24V 2,5A","LED Schaltnetzteil 24V 2.5A","Spínaný LED zdroj 24V 2,5A","Led voeding 24V, 2,5 A","not translated yet","not translated yet","not translated yet","not translated yet","not translated yet","not translated yet","not translated yet",null,null,null,null,null,29,24,35,29,29,799,29,36.99,29,29,"Not done","Not done","Not done","Not done","Not done","Not done","Not done"]
[100206.0,"Touch pure Air Weiß",149.0,null,null,100206.0,"Touch pure Air White",120.0,null,null,100206.0,"Touch pure Air White",179.0,null,null,100206.0,"Touch Pure Blanc",149.0,null,null,100206.0,"Touch pure Air Blanco",149.0,null,null,100206.0,"Touch pure Air bílá",3999.0,null,null,100206.0,"Touch pure Air bianco",149.0,null,null,100206.0,"Touch pure Air Weiß",184.26,null,null,100206.0,"Touch pure Air bílá",149.0,null,null,100206.0,"Touch Pure AIR wit",149.0,null,null,"Not done","not translated yet","Not done",null,null,"Not done","not translated yet","Not done",null,"Not done","not translated yet","Not done",null,null,"Not done","not translated yet","Not done",null,null,"Not done","not translated yet","Not done",null,null,"Not done","not translated yet","Not done",null,null,"Not done","not translated yet","Not done",null,null,null,null,null,null,null,null,159.0,100206,100206,100206,100206,100206,100206,100206,100206,100206,100206,"Not done","Not done","Not done","Not done","Not done","Not done","Not done",null,null,null,null,"Touch pure Air Weiß","Touch pure Air White","Touch pure Air White","Touch Pure Blanc","Touch pure Air Blanco","Touch pure Air bílá","Touch pure Air bianco","Touch pure Air Weiß","Touch pure Air bílá","Touch Pure AIR wit","not translated yet","not translated yet","not translated yet","not translated yet","not translated yet","not translated yet","not translated yet",null,null,null,null,null,149,120,179,149,149,3999,149,184.26,149,149,"Not done","Not done","Not done","Not done","Not done","Not done","Not done"]
[100207.0,"Touch pure Nano Weiß",119.0,null,null,100207.0,"Touch pure for Nano White",95.0,null,null,100207.0,"Touch pure for Nano White",119.0,null,null,100207.0,"Touch Pure pour Nano Blanc",119.0,null,null,100207.0,"Touch pure Nano Blanco",119.0,null,null,100207.0,"Touch pure for Nano bílá",3199.0,null,null,100207.0,"Touch pure Nano bianco",119.0,null,null,100207.0,"Touch pure Nano Weiß",147.22,null,null,100207.0,"Touch pure for Nano bílá",119.0,null,null,100207.0,"Touch Pure NANO wit",119.0,null,null,"Not done","not translated yet","Not done",null,null,"Not done","not translated yet","Not done",null,"Not done","not translated yet","Not done",null,null,"Not done","not translated yet","Not done",null,null,"Not done","not translated yet","Not done",null,null,"Not done","not translated yet","Not done",null,null,"Not done","not translated yet","Not done",null,null,null,null,null,null,null,null,160.0,100207,100207,100207,100207,100207,100207,100207,100207,100207,100207,"Not done","Not done","Not done","Not done","Not done","Not done","Not done",null,null,null,null,"Touch pure Nano Weiß","Touch pure for Nano White","Touch pure for Nano White","Touch Pure pour Nano Blanc","Touch pure Nano Blanco","Touch pure for Nano bílá","Touch pure Nano bianco","Touch pure Nano Weiß","Touch pure for Nano bílá","Touch Pure NANO wit","not translated yet","not translated yet","not translated yet","not translated yet","not translated yet","not translated yet","not translated yet",null,null,null,null,null,119,95,119,119,119,3199,119,147.22,119,119,"Not done","Not done","Not done","Not done","Not done","Not done","Not done"]
[100219.0,"Touch pure Tree Weiß",149.0,null,null,100219.0,"Touch pure Tree White",120.0,null,null,100219.0,"Touch pure Tree White",179.0,null,null,100219.0,"Touch Pure Tree Blanc",149.0,null,null,100219.0,"Touch pure Tree Blanco",149.0,null,null,100219.0,"Touch pure Tree bílá",3999.0,null,null,100219.0,"Touch pure Tree bianco",149.0,null,null,100219.0,"Touch pure Tree Weiß",184.26,null,null,100219.0,"Touch pure Tree bílá",149.0,null,null,100219.0,"Touch Pure TREE wit",149.0,null,null,"Not done","not translated yet","Not done",null,null,"Not done","not translated yet","Not done",null,"Not done","not translated yet","Not done",null,null,"Not done","not translated yet","Not done",null,null,"Not done","not translated yet","Not done",null,null,"Not done","not translated yet","Not done",null,null,"Not done","not translated yet","Not done",null,null,null,null,null,null,null,null,161.0,100219,100219,100219,100219,100219,100219,100219,100219,100219,100219,"Not done","Not done","Not done","Not done","Not done","Not done","Not done",null,null,null,null,"Touch pure Tree Weiß","Touch pure Tree White","Touch pure Tree White","Touch Pure Tree Blanc","Touch pure Tree Blanco","Touch pure Tree bílá","Touch pure Tree bianco","Touch pure Tree Weiß","Touch pure Tree bílá","Touch Pure TREE wit","not translated yet","not translated yet","not translated yet","not translated yet","not translated yet","not translated yet","not translated yet",null,null,null,null,null,149,120,179,149,149,3999,149,184.26,149,149,"Not done","Not done","Not done","Not done","Not done","Not done","Not done"]
[200108.0,"Internorm Extension",249.16,null,null,"NA","not available in this country",0.0,null,null,"not available in this country","not available in this country",0.0,null,null,"not available in this country","not available in this country",249.16,null,null,"not available in this country","not available in this country",0.0,null,null,200108.0,"Internorm Extension",6799.0,null,null,200108.0,"Internorm Extension",249.16,null,null,100232.0,"Internorm Extencion",339.0,null,null,"not available in this country","not available in this country",0.0,null,null,"not available in this country","not available in this country",0.0,null,null,"not available in this country","not available in this country",0.0,null,null,"not available in this country","not available in this country","not available in this country",null,"not available in this country","not available in this country","not available in this country",null,null,"Not done","not translated yet","Not done",null,null,"Not done","not translated yet","Not done",null,null,"Not done","not translated yet","Not done",null,null,"Not done","not translated yet","Not done",null,null,null,null,null,null,null,null,162.0,200108,"NA","not available in this country","not available in this country","not available in this country",200108,200108,100232,"not available in this country","not available in this country","not available in this country","not available in this country","not available in this country","Not done","Not done","Not done","Not done",null,null,null,null,"Internorm Extension","not available in this country","not available in this country","not available in this country","not available in this country","Internorm Extension","Internorm Extension","Internorm Extencion","not available in this country","not available in this country","not available in this country","not available in this country","not available in this country","not translated yet","not translated yet","not translated yet","not translated yet",null,null,null,null,null,249.16,0,0,249.16,0,6799,249.16,339,0,0,0,"not available in this country","not available in this country","Not done","Not done","Not done","Not done"]
[100212.0,"Nano Dimmer Air",92.0,null,null,100212.0,"Nano Dimmer Air",75.0,null,null,"not available in this country","not available in this country",0.0,null,null,100212.0,"Nano Dimmer Air",92.0,null,null,100212.0,"Nano Dimmer Air",92.0,null,null,100212.0,"Nano Dimmer Air",2499.0,null,null,100212.0,"Nano Dimmer Air",92.0,null,null,100212.0,"Nano Dimmer Air",119.45,null,null,100212.0,"Nano Dimmer Air",92.0,null,null,100212.0,"Nano Dimmer Air",92.0,null,null,"Not done","not translated yet","Not done",null,null,"Not done","not translated yet","Not done",null,"Not done","not translated yet","Not done",null,null,"Not done","not translated yet","Not done",null,null,"Not done","not translated yet","Not done",null,null,"Not done","not translated yet","Not done",null,null,"Not done","not translated yet","Not done",null,null,null,null,null,null,null,null,163.0,100212,100212,"not available in this country",100212,100212,100212,100212,100212,100212,100212,"Not done","Not done","Not done","Not done","Not done","Not done","Not done",null,null,null,null,"Nano Dimmer Air","Nano Dimmer Air","not available in this country","Nano Dimmer Air","Nano Dimmer Air","Nano Dimmer Air","Nano Dimmer Air","Nano Dimmer Air","Nano Dimmer Air","Nano Dimmer Air","not translated yet","not translated yet","not translated yet","not translated yet","not translated yet","not translated yet","not translated yet",null,null,null,null,null,92,75,0,92,92,2499,92,119.45,92,92,"Not done","Not done","Not done","Not done","Not done","Not done","Not done"]
[200300.0,"Rangierdraht (100m) blau/weiß",11.0,null,null,"NA","not available in this country",0.0,null,null,200300.0,"Panel wire (328ft) blue/white",30.5,null,null,200300.0,"Câble d'interconnexion (100m) bleu/blanc",11.0,null,null,200300.0,"Cable para puentes (100mts) azul/blanco",11.0,null,null,200300.0,"Dvoužilový kroucený kabel modrá/bílá",299.0,null,null,200300.0,"Cavo due fili twistati (100m) blu/bianco",11.0,null,null,200300.0,"Rangierdraht (100m) blau/weiß",13.85,null,null,200300.0,"Dvoužilový kroucený kabel modrá/bílá",11.0,null,null,200300.0,"Verbindingsdraad (100m) blauw/wit",11.0,null,null,"Not done","not translated yet","Not done",null,null,"Not done","not translated yet","Not done",null,"Not done","not translated yet","Not done",null,null,"Not done","not translated yet","Not done",null,null,"Not done","not translated yet","Not done",null,null,"Not done","not translated yet","Not done",null,null,"Not done","not translated yet","Not done",null,null,null,null,null,null,null,null,164.0,200300,"NA",200300,200300,200300,200300,200300,200300,200300,200300,"Not done","Not done","Not done","Not done","Not done","Not done","Not done",null,null,null,null,"Rangierdraht (100m) blau/weiß","not available in this country","Panel wire (328ft) blue/white","Câble d'interconnexion (100m) bleu/blanc","Cable para puentes (100mts) azul/blanco","Dvoužilový kroucený kabel modrá/bílá","Cavo due fili twistati (100m) blu/bianco","Rangierdraht (100m) blau/weiß","Dvoužilový kroucený kabel modrá/bílá","Verbindingsdraad (100m) blauw/wit","not translated yet","not translated yet","not translated yet","not translated yet","not translated yet","not translated yet","not translated yet",null,null,null,null,null,11,0,30.5,11,11,299,11,13.85,11,11,"Not done","Not done","Not done","Not done","Not done","Not done","Not done"]
[200301.0,"Rangierdraht (100m) orange/weiß",11.0,null,null,"NA","not available in this country",0.0,null,null,200301.0,"Panel wire (328ft) orange/white",30.5,null,null,200301.0,"Câble d'interconnexion (100m) orange/blanc",11.0,null,null,200301.0,"Cable para puentes (100mts) naranja/blanco",11.0,null,null,200301.0,"Dvoužilový kroucený kabel oranžová/bílá",299.0,null,null,200301.0,"Cavo due fili twistati (100m) arancione/bianco",11.0,null,null,200301.0,"Rangierdraht (100m) orange/weiß",13.85,null,null,200301.0,"Dvoužilový kroucený kabel oranžová/bílá",11.0,null,null,200301.0,"Verbindingsdraad (100m) oranje/wit",11.0,null,null,"Not done","not translated yet","Not done",null,null,"Not done","not translated yet","Not done",null,"Not done","not translated yet","Not done",null,null,"Not done","not translated yet","Not done",null,null,"Not done","not translated yet","Not done",null,null,"Not done","not translated yet","Not done",null,null,"Not done","not translated yet","Not done",null,null,null,null,null,null,null,null,165.0,200301,"NA",200301,200301,200301,200301,200301,200301,200301,200301,"Not done","Not done","Not done","Not done","Not done","Not done","Not done",null,null,null,null,"Rangierdraht (100m) orange/weiß","not available in this country","Panel wire (328ft) orange/white","Câble d'interconnexion (100m) orange/blanc","Cable para puentes (100mts) naranja/blanco","Dvoužilový kroucený kabel oranžová/bílá","Cavo due fili twistati (100m) arancione/bianco","Rangierdraht (100m) orange/weiß","Dvoužilový kroucený kabel oranžová/bílá","Verbindingsdraad (100m) oranje/wit","not translated yet","not translated yet","not translated yet","not translated yet","not translated yet","not translated yet","not translated yet",null,null,null,null,null,11,0,30.5,11,11,299,11,13.85,11,11,"Not done","Not done","Not done","Not done","Not done","Not done","Not done"]
[200302.0,"Rangierdraht (100m) grün/weiß",11.0,null,null,"NA","not available in this country",0.0,null,null,200302.0,"Panel wire (328ft) green/white",30.5,null,null,200302.0,"Câble d'interconnexion (100m) vert/blanc",11.0,null,null,200302.0,"Cable para puentes (100mts) verde/blanco",11.0,null,null,200302.0,"Dvoužilový kroucený kabel zelená/bílá",299.0,null,null,200302.0,"Cavo due fili twistati (100m) verde/bianco",11.0,null,null,200302.0,"Rangierdraht (100m) grün/weiß",13.85,null,null,200302.0,"Dvoužilový kroucený kabel zelená/bílá",11.0,null,null,200302.0,"Verbindingsdraad (100m) groen/wit",11.0,null,null,"Not done","not translated yet","Not done",null,null,"Not done","not translated yet","Not done",null,"Not done","not translated yet","Not done",null,null,"Not done","not translated yet","Not done",null,null,"Not done","not translated yet","Not done",null,null,"Not done","not translated yet","Not done",null,null,"Not done","not translated yet","Not done",null,null,null,null,null,null,null,null,166.0,200302,"NA",200302,200302,200302,200302,200302,200302,200302,200302,"Not done","Not done","Not done","Not done","Not done","Not done","Not done",null,null,null,null,"Rangierdraht (100m) grün/weiß","not available in this country","Panel wire (328ft) green/white","Câble d'interconnexion (100m) vert/blanc","Cable para puentes (100mts) verde/blanco","Dvoužilový kroucený kabel zelená/bílá","Cavo due fili twistati (100m) verde/bianco","Rangierdraht (100m) grün/weiß","Dvoužilový kroucený kabel zelená/bílá","Verbindingsdraad (100m) groen/wit","not translated yet","not translated yet","not translated yet","not translated yet","not translated yet","not translated yet","not translated yet",null,null,null,null,null,11,0,30.5,11,11,299,11,13.85,11,11,"Not done","Not done","Not done","Not done","Not done","Not done","Not done"]
[200287.0,"Duracell Plus Power AA (12 Stk.)",9.5,null,null,200287.0,"Duracell Plus Power AA (Pack of 12)",8.25,null,null,"not available in this country","not available in this country",0.0,null,null,200287.0,"Duracell Plus Power AA (12 Stk.)",9.5,null,null,200287.0,"Duracell Plus Power AA (12 Stk.)",9.5,null,null,200287.0,"Duracell Plus Power AA (12 ks)",215.0,null,null,200287.0,"Duracell Plus Power AA (12 pz.)",9.5,null,null,200287.0,"Duracell Plus Power AA (12 Stk.)",13.85,null,null,200287.0,"Duracell Plus Power AA (12 ks)",9.5,null,null,200287.0,"Duracell Plus Power AA (12 St.)",9.5,null,null,"Not done","not translated yet","Not done",null,null,"Not done","not translated yet","Not done",null,"Not done","not translated yet","Not done",null,null,"Not done","not translated yet","Not done",null,null,"Not done","not translated yet","Not done",null,null,"Not done","not translated yet","Not done",null,null,"Not done","not translated yet","Not done",null,null,null,null,null,null,null,null,167.0,200287,200287,"not available in this country",200287,200287,200287,200287,200287,200287,200287,"Not done","Not done","Not done","Not done","Not done","Not done","Not done",null,null,null,null,"Duracell Plus Power AA (12 Stk.)","Duracell Plus Power AA (Pack of 12)","not available in this country","Duracell Plus Power AA (12 Stk.)","Duracell Plus Power AA (12 Stk.)","Duracell Plus Power AA (12 ks)","Duracell Plus Power AA (12 pz.)","Duracell Plus Power AA (12 Stk.)","Duracell Plus Power AA (12 ks)","Duracell Plus Power AA (12 St.)","not translated yet","not translated yet","not translated yet","not translated yet","not translated yet","not translated yet","not translated yet",null,null,null,null,null,9.5,8.25,0,9.5,9.5,215,9.5,13.85,9.5,9.5,"Not done","Not done","Not done","Not done","Not done","Not done","Not done"]
[200288.0,"Duracell Plus Power AAA (12 Stk.)",9.5,null,null,200288.0,"Duracell Plus Power AAA (Pack of 12)",8.25,null,null,"not available in this country","not available in this country",0.0,null,null,200288.0,"Duracell Plus Power AAA (12 Stk.)",9.5,null,null,200288.0,"Duracell Plus Power AAA (12 Stk.)",9.5,null,null,200288.0,"Duracell Plus Power AAA (12 ks)",215.0,null,null,200288.0,"Duracell Plus Power AAA (12 pz.)",9.5,null,null,200288.0,"Duracell Plus Power AAA (12 Stk.)",13.85,null,null,200288.0,"Duracell Plus Power AAA (12 ks)",9.5,null,null,200288.0,"Duracell Plus Power AAA (12 St.)",9.5,null,null,"Not done","not translated yet","Not done",null,null,"Not done","not translated yet","Not done",null,"Not done","not translated yet","Not done",null,null,"Not done","not translated yet","Not done",null,null,"Not done","not translated yet","Not done",null,null,"Not done","not translated yet","Not done",null,null,"Not done","not translated yet","Not done",null,null,null,null,null,null,null,null,168.0,200288,200288,"not available in this country",200288,200288,200288,200288,200288,200288,200288,"Not done","Not done","Not done","Not done","Not done","Not done","Not done",null,null,null,null,"Duracell Plus Power AAA (12 Stk.)","Duracell Plus Power AAA (Pack of 12)","not available in this country","Duracell Plus Power AAA (12 Stk.)","Duracell Plus Power AAA (12 Stk.)","Duracell Plus Power AAA (12 ks)","Duracell Plus Power AAA (12 pz.)","Duracell Plus Power AAA (12 Stk.)","Duracell Plus Power AAA (12 ks)","Duracell Plus Power AAA (12 St.)","not translated yet","not translated yet","not translated yet","not translated yet","not translated yet","not translated yet","not translated yet",null,null,null,null,null,9.5,8.25,0,9.5,9.5,215,9.5,13.85,9.5,9.5,"Not done","Not done","Not done","Not done","Not done","Not done","Not done"]
[200289.0,"Knopfzelle CR2032 (20 Stk. Z.B. Remote)",10.0,null,null,200289.0,"CR2032 Lithium Battery (Pack of 20)",8.25,null,null,"not available in this country","not available in this country",0.0,null,null,200289.0,"Pile bouton CR2032 (20 Stk. Z.B. Remote)",10.0,null,null,200289.0,"Pila botón CR2032 (20 Uni.)",10.0,null,null,200289.0,"CR2032 Lithium Battery (20 ks)",269.0,null,null,200289.0,"Pila a bottone CR2032 (20 pz. p.es. Remote)",10.0,null,null,200289.0,"Knopfzelle CR2032 (20 Stk. Z.B. Remote)",12.92,null,null,200289.0,"CR2032 Lithium Battery (20 ks)",10.0,null,null,200289.0,"Knoopbatterij CR2032 (20 St. vb. Remote)",10.0,null,null,"Not done","not translated yet","Not done",null,null,"Not done","not translated yet","Not done",null,"Not done","not translated yet","Not done",null,null,"Not done","not translated yet","Not done",null,null,"Not done","not translated yet","Not done",null,null,"Not done","not translated yet","Not done",null,null,"Not done","not translated yet","Not done",null,null,null,null,null,null,null,null,169.0,200289,200289,"not available in this country",200289,200289,200289,200289,200289,200289,200289,"Not done","Not done","Not done","Not done","Not done","Not done","Not done",null,null,null,null,"Knopfzelle CR2032 (20 Stk. Z.B. Remote)","CR2032 Lithium Battery (Pack of 20)","not available in this country","Pile bouton CR2032 (20 Stk. Z.B. Remote)","Pila botón CR2032 (20 Uni.)","CR2032 Lithium Battery (20 ks)","Pila a bottone CR2032 (20 pz. p.es. Remote)","Knopfzelle CR2032 (20 Stk. Z.B. Remote)","CR2032 Lithium Battery (20 ks)","Knoopbatterij CR2032 (20 St. vb. Remote)","not translated yet","not translated yet","not translated yet","not translated yet","not translated yet","not translated yet","not translated yet",null,null,null,null,null,10,8.25,0,10,10,269,10,12.92,10,10,"Not done","Not done","Not done","Not done","Not done","Not done","Not done"]
[200290.0,"Knopfzelle CR2450 (20 Stk. Z.B. Touch Air)",22.5,null,null,200290.0,"CR2450 Lithium Battery (Pack of 20)",18.75,null,null,"not available in this country","not available in this country",0.0,null,null,200290.0,"Pile bouton CR2450 (20 Stk. Z.B. Touch Air)",22.5,null,null,200290.0,"Pila botón CR2450 (20 Uni.)",22.5,null,null,200290.0,"CR2450 Lithium Battery (20 ks)",599.0,null,null,200290.0,"Pila a bottone CR2450 (20 pz. p.es. Touch Air)",22.5,null,null,200290.0,"Knopfzelle CR2450 (20 Stk. Z.B. Touch Air)",28.66,null,null,200290.0,"CR2450 Lithium Battery (20 ks)",22.5,null,null,200290.0,"Knoopbatterij CR2450 (20 St. vb. Touch Air)",22.5,null,null,"Not done","not translated yet","Not done",null,null,"Not done","not translated yet","Not done",null,"Not done","not translated yet","Not done",null,null,"Not done","not translated yet","Not done",null,null,"Not done","not translated yet","Not done",null,null,"Not done","not translated yet","Not done",null,null,"Not done","not translated yet","Not done",null,null,null,null,null,null,null,null,170.0,200290,200290,"not available in this country",200290,200290,200290,200290,200290,200290,200290,"Not done","Not done","Not done","Not done","Not done","Not done","Not done",null,null,null,null,"Knopfzelle CR2450 (20 Stk. Z.B. Touch Air)","CR2450 Lithium Battery (Pack of 20)","not available in this country","Pile bouton CR2450 (20 Stk. Z.B. Touch Air)","Pila botón CR2450 (20 Uni.)","CR2450 Lithium Battery (20 ks)","Pila a bottone CR2450 (20 pz. p.es. Touch Air)","Knopfzelle CR2450 (20 Stk. Z.B. Touch Air)","CR2450 Lithium Battery (20 ks)","Knoopbatterij CR2450 (20 St. vb. Touch Air)","not translated yet","not translated yet","not translated yet","not translated yet","not translated yet","not translated yet","not translated yet",null,null,null,null,null,22.5,18.75,0,22.5,22.5,599,22.5,28.66,22.5,22.5,"Not done","Not done","Not done","Not done","Not done","Not done","Not done"]
[200291.0,"FDK 9V Lithiumzelle (z.B. Rauchmelder Air)",9.0,null,null,200291.0,"FDK 9V Lithium Battery",7.5,null,null,"not available in this country","not available in this country",0.0,null,null,200291.0,"FDK 9V Pile Lithium (Ex. détecteur de fumée Air)",9.0,null,null,200291.0,"FDK 9V Pila Litio (ej det Humo)",9.0,null,null,200291.0,"FDK 9V Lithium Battery",245.0,null,null,200291.0,"FDK 9V batteria al litio (p.e.s. rilevatore fumo Air)",9.0,null,null,200291.0,"FDK 9V Lithiumzelle (z.B. Rauchmelder Air)",12.0,null,null,200291.0,"FDK 9V Lithium Battery",9.0,null,null,200291.0,"FDK 9V Lithiumbatterij (vb. Rookmelder Air)",9.0,null,null,"Not done","not translated yet","Not done",null,null,"Not done","not translated yet","Not done",null,"Not done","not translated yet","Not done",null,null,"Not done","not translated yet","Not done",null,null,"Not done","not translated yet","Not done",null,null,"Not done","not translated yet","Not done",null,null,"Not done","not translated yet","Not done",null,null,null,null,null,null,null,null,171.0,200291,200291,"not available in this country",200291,200291,200291,200291,200291,200291,200291,"Not done","Not done","Not done","Not done","Not done","Not done","Not done",null,null,null,null,"FDK 9V Lithiumzelle (z.B. Rauchmelder Air)","FDK 9V Lithium Battery","not available in this country","FDK 9V Pile Lithium (Ex. détecteur de fumée Air)","FDK 9V Pila Litio (ej det Humo)","FDK 9V Lithium Battery","FDK 9V batteria al litio (p.e.s. rilevatore fumo Air)","FDK 9V Lithiumzelle (z.B. Rauchmelder Air)","FDK 9V Lithium Battery","FDK 9V Lithiumbatterij (vb. Rookmelder Air)","not translated yet","not translated yet","not translated yet","not translated yet","not translated yet","not translated yet","not translated yet",null,null,null,null,null,9,7.5,0,9,9,245,9,12,9,9,"Not done","Not done","Not done","Not done","Not done","Not done","Not done"]
[100242.0,"Nano DI Tree",62.0,null,null,100242.0,"Nano DI Tree",52.5,null,null,100242.0,"Nano DI Tree",69.0,null,null,100242.0,"Interface BP Tree",62.0,null,null,100242.0,"Nano DI Tree",62.0,null,null,100242.0,"Nano DI Tree",1699.0,null,null,100242.0,"Nano DI Tree",62.0,null,null,100242.0,"Nano DI Tree",86.57,null,null,100242.0,"Nano DI Tree",62.0,null,null,100242.0,"Nano DI Tree",62.0,null,null,"Not done","not translated yet","Not done",null,null,"Not done","not translated yet","Not done",null,"Not done","not translated yet","Not done",null,null,"Not done","not translated yet","Not done",null,null,"Not done","not translated yet","Not done",null,null,"Not done","not translated yet","Not done",null,null,"Not done","not translated yet","Not done",null,null,null,null,null,null,null,null,172.0,100242,100242,100242,100242,100242,100242,100242,100242,100242,100242,"Not done","Not done","Not done","Not done","Not done","Not done","Not done",null,null,null,null,"Nano DI Tree","Nano DI Tree","Nano DI Tree","Interface BP Tree","Nano DI Tree","Nano DI Tree","Nano DI Tree","Nano DI Tree","Nano DI Tree","Nano DI Tree","not translated yet","not translated yet","not translated yet","not translated yet","not translated yet","not translated yet","not translated yet",null,null,null,null,null,62,52.5,69,62,62,1699,62,86.57,62,62,"Not done","Not done","Not done","Not done","Not done","Not done","Not done"]
[0.0,"Feller Adapter Set x10",0.0,null,null,"not available in this country","not available in this country",0.0,null,null,"not available in this country","not available in this country",0.0,null,null,0.0,"Feller adaptateur complet/ 10 pièces",0.0,null,null,"not available in this country","not available in this country",0.0,null,null,"not available in this country","not available in this country",0.0,null,null,0.0,"Feller Adattatore Completo/ 10 pezzi",0.0,null,null,100294.0,"Feller Adapter Set x10",83.3,null,null,"not available in this country","not available in this country",0.0,null,null,"not available in this country","not available in this country",0.0,null,null,"not available in this country","not available in this country",0.0,null,null,"not available in this country","not available in this country",0.0,null,"not available in this country","not available in this country",0.0,null,null,"not available in this country","not available in this country",0.0,null,null,"not available in this country","not available in this country",0.0,null,null,"not available in this country","not available in this country",0.0,null,null,"not available in this country","not available in this country",0.0,null,null,null,null,null,null,null,null,173.0,0,"not available in this country","not available in this country",0,"not available in this country","not available in this country",0,100294,"not available in this country","not available in this country","not available in this country","not available in this country","not available in this country","not available in this country","not available in this country","not available in this country","not available in this country",null,null,null,null,"Feller Adapter Set x10","not available in this country","not available in this country","Feller adaptateur complet/ 10 pièces","not available in this country","not available in this country","Feller Adattatore Completo/ 10 pezzi","Feller Adapter Set x10","not available in this country","not available in this country","not available in this country","not available in this country","not available in this country","not available in this country","not available in this country","not available in this country","not available in this country",null,null,null,null,null,0,0,0,0,0,0,0,83.3,0,0,0,0,0,0,0,0,0]
[100209.0,"Touch pure Nano Anthrazit",119.0,null,null,100209.0,"Touch pure for Nano Anthracite",95.0,null,null,100209.0,"Touch pure Nano Black",119.0,null,null,100209.0,"Touch pure for Nano Anthracite",119.0,null,null,100209.0,"Touch pure para Nano Antracita",119.0,null,null,100209.0,"Touch pure for Nano Anthracite",3199.0,null,null,100209.0,"Touch pure Nano antracite",119.0,null,null,100209.0,"Touch pure Nano anthrazit",147.22,null,null,100209.0,"Touch pure for Nano Anthracite",119.0,null,null,100209.0,"Touch pure Nano Anthraciet",119.0,null,null,"Not done","not translated yet","Not done",null,null,"Not done","not translated yet","Not done",null,"Not done","not translated yet","Not done",null,null,"Not done","not translated yet","Not done",null,null,"Not done","not translated yet","Not done",null,null,"Not done","not translated yet","Not done",null,null,"Not done","not translated yet","Not done",null,null,null,null,null,null,null,null,174.0,100209,100209,100209,100209,100209,100209,100209,100209,100209,100209,"Not done","Not done","Not done","Not done","Not done","Not done","Not done",null,null,null,null,"Touch pure Nano Anthrazit","Touch pure for Nano Anthracite","Touch pure Nano Black","Touch pure for Nano Anthracite","Touch pure para Nano Antracita","Touch pure for Nano Anthracite","Touch pure Nano antracite","Touch pure Nano anthrazit","Touch pure for Nano Anthracite","Touch pure Nano Anthraciet","not translated yet","not translated yet","not translated yet","not translated yet","not translated yet","not translated yet","not translated yet",null,null,null,null,null,119,95,119,119,119,3199,119,147.22,119,119,"Not done","Not done","Not done","Not done","Not done","Not done","Not done"]
[100220.0,"Touch pure Tree Anthrazit",149.0,null,null,100220.0,"Touch pure for Tree Anthracite",120.0,null,null,100220.0,"Touch pure Tree Black",179.0,null,null,100220.0,"Touch pure Tree Anthracite",149.0,null,null,100220.0,"Touch pure Tree Antracita",149.0,null,null,100220.0,"Touch pure for Tree Anthracite",3999.0,null,null,100220.0,"Touch pure Tree antracite",149.0,null,null,100220.0,"Touch pure Tree anthrazit",184.26,null,null,100220.0,"Touch pure for Tree Anthracite",149.0,null,null,100220.0,"Touch pure Tree Anthraciet",149.0,null,null,"Not done","not translated yet","Not done",null,null,"Not done","not translated yet","Not done",null,"Not done","not translated yet","Not done",null,null,"Not done","not translated yet","Not done",null,null,"Not done","not translated yet","Not done",null,null,"Not done","not translated yet","Not done",null,null,"Not done","not translated yet","Not done",null,null,null,null,null,null,null,null,175.0,100220,100220,100220,100220,100220,100220,100220,100220,100220,100220,"Not done","Not done","Not done","Not done","Not done","Not done","Not done",null,null,null,null,"Touch pure Tree Anthrazit","Touch pure for Tree Anthracite","Touch pure Tree Black","Touch pure Tree Anthracite","Touch pure Tree Antracita","Touch pure for Tree Anthracite","Touch pure Tree antracite","Touch pure Tree anthrazit","Touch pure for Tree Anthracite","Touch pure Tree Anthraciet","not translated yet","not translated yet","not translated yet","not translated yet","not translated yet","not translated yet","not translated yet",null,null,null,null,null,149,120,179,149,149,3999,149,184.26,149,149,"Not done","Not done","Not done","Not done","Not done","Not done","Not done"]
[100208.0,"Touch pure Air Anthrazit",149.0,null,null,100208.0,"Touch pure Air Anthracite",120.0,null,null,100208.0,"Touch pure Air Black",179.0,null,null,100208.0,"Touch pure Air Anthracite",149.0,null,null,100208.0,"Touch pure Air Antracita",149.0,null,null,100208.0,"Touch pure Air Anthracite",3999.0,null,null,100208.0,"Touch pure Air antracite",149.0,null,null,100208.0,"Touch pure Air anthrazit",184.26,null,null,100208.0,"Touch pure Air Anthracite",149.0,null,null,100208.0,"Touch pure Air Anthraciet",149.0,null,null,"Not done","not translated yet","Not done",null,null,"Not done","not translated yet","Not done",null,"Not done","not translated yet","Not done",null,null,"Not done","not translated yet","Not done",null,null,"Not done","not translated yet","Not done",null,null,"Not done","not translated yet","Not done",null,null,"Not done","not translated yet","Not done",null,null,null,null,null,null,null,null,176.0,100208,100208,100208,100208,100208,100208,100208,100208,100208,100208,"Not done","Not done","Not done","Not done","Not done","Not done","Not done",null,null,null,null,"Touch pure Air Anthrazit","Touch pure Air Anthracite","Touch pure Air Black","Touch pure Air Anthracite","Touch pure Air Antracita","Touch pure Air Anthracite","Touch pure Air antracite","Touch pure Air anthrazit","Touch pure Air Anthracite","Touch pure Air Anthraciet","not translated yet","not translated yet","not translated yet","not translated yet","not translated yet","not translated yet","not translated yet",null,null,null,null,null,149,120,179,149,149,3999,149,184.26,149,149,"Not done","Not done","Not done","Not done","Not done","Not done","Not done"]
[100235.0,"LED Aufbauspot RGBW weiß",79.0,null,null,100235.0,"LED Ceiling Spot RGBW",65.0,null,null,100235.0,"LED Ceiling Spot RGBW",89.0,null,null,100235.0,"Spot LED Plafonnier RGBW",79.0,null,null,100235.0,"LED Spot RGBW de Superfície",79.0,null,null,100235.0,"Příložný LED Spot RGBW bílá",2149.0,null,null,100235.0,"Led spot da soffitto RGBW bianco",79.0,null,null,100235.0,"LED Aufbauspot RGBW weiß",111.11,null,null,100235.0,"LED Ceiling Spot RGBW",79.0,null,null,100235.0,"LED Ceiling Spot RGBW",79.0,null,null,"Not done","not translated yet","Not done",null,null,"Not done","not translated yet","Not done",null,"Not done","not translated yet","Not done",null,null,"Not done","not translated yet","Not done",null,null,"Not done","not translated yet","Not done",null,null,"Not done","not translated yet","Not done",null,null,"Not done","not translated yet","Not done",null,null,null,null,null,null,null,null,177.0,100235,100235,100235,100235,100235,100235,100235,100235,100235,100235,"Not done","Not done","Not done","Not done","Not done","Not done","Not done",null,null,null,null,"LED Aufbauspot RGBW weiß","LED Ceiling Spot RGBW","LED Ceiling Spot RGBW","Spot LED Plafonnier RGBW","LED Spot RGBW de Superfície","Příložný LED Spot RGBW bílá","Led spot da soffitto RGBW bianco","LED Aufbauspot RGBW weiß","LED Ceiling Spot RGBW","LED Ceiling Spot RGBW","not translated yet","not translated yet","not translated yet","not translated yet","not translated yet","not translated yet","not translated yet",null,null,null,null,null,79,65,89,79,79,2149,79,111.11,79,79,"Not done","Not done","Not done","Not done","Not done","Not done","Not done"]
[100236.0,"LED Aufbauspot WW weiß",59.0,null,null,100236.0,"LED Ceiling Spot WW",47.5,null,null,100236.0,"LED Ceiling Spot WW",69.0,null,null,100236.0,"Spot LED Plafonnier WW",59.0,null,null,100236.0,"LED Spot WW de Superfície",59.0,null,null,100236.0,"Příložný LED Spot WW bílá",1599.0,null,null,100236.0,"Led spot da soffitto WW bianco",59.0,null,null,100236.0,"LED Aufbauspot WW weiß",83.33,null,null,100236.0,"LED Ceiling Spot WW",59.0,null,null,100236.0,"LED Ceiling Spot WW",59.0,null,null,"Not done","not translated yet","Not done",null,null,"Not done","not translated yet","Not done",null,"Not done","not translated yet","Not done",null,null,"Not done","not translated yet","Not done",null,null,"Not done","not translated yet","Not done",null,null,"Not done","not translated yet","Not done",null,null,"Not done","not translated yet","Not done",null,null,null,null,null,null,null,null,178.0,100236,100236,100236,100236,100236,100236,100236,100236,100236,100236,"Not done","Not done","Not done","Not done","Not done","Not done","Not done",null,null,null,null,"LED Aufbauspot WW weiß","LED Ceiling Spot WW","LED Ceiling Spot WW","Spot LED Plafonnier WW","LED Spot WW de Superfície","Příložný LED Spot WW bílá","Led spot da soffitto WW bianco","LED Aufbauspot WW weiß","LED Ceiling Spot WW","LED Ceiling Spot WW","not translated yet","not translated yet","not translated yet","not translated yet","not translated yet","not translated yet","not translated yet",null,null,null,null,null,59,47.5,69,59,59,1599,59,83.33,59,59,"Not done","Not done","Not done","Not done","Not done","Not done","Not done"]
[100237.0,"LED Aufbauspot Tree RGBW weiß",119.0,null,null,100237.0,"LED Ceiling Spot Tree RGBW",100.0,null,null,100237.0,"LED Ceiling Spot Tree RGBW",139.0,null,null,100237.0,"Spot LED Plafonnier Tree RGBW",119.0,null,null,100237.0,"LED Spot Tree RGBW de Superfície",119.0,null,null,100237.0,"Příložný LED Spot Tree RGBW bílá",3199.0,null,null,100237.0,"Led spot da soffitto Tree RGBW bianco",119.0,null,null,100237.0,"LED Aufbauspot Tree RGBW weiß",166.67,null,null,100237.0,"LED Ceiling Spot Tree RGBW",119.0,null,null,100237.0,"LED Ceiling Spot Tree RGBW",119.0,null,null,"Not done","not translated yet","Not done",null,null,"Not done","not translated yet","Not done",null,"Not done","not translated yet","Not done",null,null,"Not done","not translated yet","Not done",null,null,"Not done","not translated yet","Not done",null,null,"Not done","not translated yet","Not done",null,null,"Not done","not translated yet","Not done",null,null,null,null,null,null,null,null,179.0,100237,100237,100237,100237,100237,100237,100237,100237,100237,100237,"Not done","Not done","Not done","Not done","Not done","Not done","Not done",null,null,null,null,"LED Aufbauspot Tree RGBW weiß","LED Ceiling Spot Tree RGBW","LED Ceiling Spot Tree RGBW","Spot LED Plafonnier Tree RGBW","LED Spot Tree RGBW de Superfície","Příložný LED Spot Tree RGBW bílá","Led spot da soffitto Tree RGBW bianco","LED Aufbauspot Tree RGBW weiß","LED Ceiling Spot Tree RGBW","LED Ceiling Spot Tree RGBW","not translated yet","not translated yet","not translated yet","not translated yet","not translated yet","not translated yet","not translated yet",null,null,null,null,null,119,100,139,119,119,3199,119,166.67,119,119,"Not done","Not done","Not done","Not done","Not done","Not done","Not done"]
[100238.0,"LED Aufbauspot Tree WW weiß",99.0,null,null,100238.0,"LED Ceiling Spot Tree WW",82.5,null,null,100238.0,"LED Ceiling Spot Tree WW",109.0,null,null,100238.0,"Spot LED Plafonnier Tree WW",99.0,null,null,100238.0,"LED Spot Tree WW de Superfície",99.0,null,null,100238.0,"Příložný LED Spot Tree WW bílá",2699.0,null,null,100238.0,"Led spot da soffitto Tree WW bianco",99.0,null,null,100238.0,"LED Aufbauspot Tree WW weiß",138.89,null,null,100238.0,"LED Ceiling Spot Tree WW",99.0,null,null,100238.0,"LED Ceiling Spot Tree WW",99.0,null,null,"Not done","not translated yet","Not done",null,null,"Not done","not translated yet","Not done",null,"Not done","not translated yet","Not done",null,null,"Not done","not translated yet","Not done",null,null,"Not done","not translated yet","Not done",null,null,"Not done","not translated yet","Not done",null,null,"Not done","not translated yet","Not done",null,null,null,null,null,null,null,null,180.0,100238,100238,100238,100238,100238,100238,100238,100238,100238,100238,"Not done","Not done","Not done","Not done","Not done","Not done","Not done",null,null,null,null,"LED Aufbauspot Tree WW weiß","LED Ceiling Spot Tree WW","LED Ceiling Spot Tree WW","Spot LED Plafonnier Tree WW","LED Spot Tree WW de Superfície","Příložný LED Spot Tree WW bílá","Led spot da soffitto Tree WW bianco","LED Aufbauspot Tree WW weiß","LED Ceiling Spot Tree WW","LED Ceiling Spot Tree WW","not translated yet","not translated yet","not translated yet","not translated yet","not translated yet","not translated yet","not translated yet",null,null,null,null,null,99,82.5,109,99,99,2699,99,138.89,99,99,"Not done","Not done","Not done","Not done","Not done","Not done","Not done"]
[100268.0,"LED Spot Tree WW weiß",59.0,null,null,100268.0,"LED Spot Tree WW",47.5,null,null,100268.0,"LED Spot Tree WW",69.0,null,null,100268.0,"Spot LED Tree WW",59.0,null,null,100268.0,"LED Spot Tree WW",59.0,null,null,100268.0,"LED Spot Tree WW bílá",1599.0,null,null,100268.0,"Led spot Tree WW bianco",59.0,null,null,100268.0,"Led Spot Tree WW weiß",83.33,null,null,100268.0,"LED Spot Tree WW",59.0,null,null,100268.0,"LED Spot Tree WW",59.0,null,null,"Not done","not translated yet","Not done",null,null,"Not done","not translated yet","Not done",null,"Not done","not translated yet","Not done",null,null,"Not done","not translated yet","Not done",null,null,"Not done","not translated yet","Not done",null,null,"Not done","not translated yet","Not done",null,null,"Not done","not translated yet","Not done",null,null,null,null,null,null,null,null,181.0,100268,100268,100268,100268,100268,100268,100268,100268,100268,100268,"Not done","Not done","Not done","Not done","Not done","Not done","Not done",null,null,null,null,"LED Spot Tree WW weiß","LED Spot Tree WW","LED Spot Tree WW","Spot LED Tree WW","LED Spot Tree WW","LED Spot Tree WW bílá","Led spot Tree WW bianco","Led Spot Tree WW weiß","LED Spot Tree WW","LED Spot Tree WW","not translated yet","not translated yet","not translated yet","not translated yet","not translated yet","not translated yet","not translated yet",null,null,null,null,null,59,47.5,69,59,59,1599,59,83.33,59,59,"Not done","Not done","Not done","Not done","Not done","Not done","Not done"]
[100269.0,"LED Spot Tree RGBW weiß",79.0,null,null,100269.0,"LED Spot Tree RGBW",65.0,null,null,100269.0,"LED Spot Tree RGBW",89.0,null,null,100269.0,"Spot LED Tree RGBW",79.0,null,null,100269.0,"LED Spot Tree RGBW",79.0,null,null,100269.0,"LED Spot Tree RGBW bílá",2149.0,null,null,100269.0,"Led spot Tree RGBW bianco",79.0,null,null,100269.0,"Led Spot Tree RGBW weiß",111.11,null,null,100269.0,"LED Spot Tree RGBW",79.0,null,null,100269.0,"LED Spot Tree RGBW",79.0,null,null,"Not done","not translated yet","Not done",null,null,"Not done","not translated yet","Not done",null,"Not done","not translated yet","Not done",null,null,"Not done","not translated yet","Not done",null,null,"Not done","not translated yet","Not done",null,null,"Not done","not translated yet","Not done",null,null,"Not done","not translated yet","Not done",null,null,null,null,null,null,null,null,182.0,100269,100269,100269,100269,100269,100269,100269,100269,100269,100269,"Not done","Not done","Not done","Not done","Not done","Not done","Not done",null,null,null,null,"LED Spot Tree RGBW weiß","LED Spot Tree RGBW","LED Spot Tree RGBW","Spot LED Tree RGBW","LED Spot Tree RGBW","LED Spot Tree RGBW bílá","Led spot Tree RGBW bianco","Led Spot Tree RGBW weiß","LED Spot Tree RGBW","LED Spot Tree RGBW","not translated yet","not translated yet","not translated yet","not translated yet","not translated yet","not translated yet","not translated yet",null,null,null,null,null,79,65,89,79,79,2149,79,111.11,79,79,"Not done","Not done","Not done","Not done","Not done","Not done","Not done"]
[100239.0,"RGBW 24V Dimmer Tree",59.9,null,null,100239.0,"RGBW 24V Dimmer Tree",55.0,null,null,100239.0,"RGBW 24V Dimmer Tree",69.0,null,null,100239.0,"RGBW 24V Dimmer Tree",59.9,null,null,100239.0,"RGBW 24V Dimmer Tree",59.9,null,null,100239.0,"RGBW 24V Dimmer Tree",59.9,null,null,100239.0,"RGBW 24V Dimmer Tree",59.9,null,null,100239.0,"RGBW 24V Dimmer Tree",59.9,null,null,100239.0,"RGBW 24V Dimmer Tree",59.9,null,null,100239.0,"RGBW 24V Dimmer Tree",59.9,null,null,"Not done","not translated yet","Not done",null,null,"Not done","not translated yet","Not done",null,"Not done","not translated yet","Not done",null,null,"Not done","not translated yet","Not done",null,null,"Not done","not translated yet","Not done",null,null,"Not done","not translated yet","Not done",null,null,"Not done","not translated yet","Not done",null,null,null,null,null,null,null,null,183.0,100239,100239,100239,100239,100239,100239,100239,100239,100239,100239,"Not done","Not done","Not done","Not done","Not done","Not done","Not done",null,null,null,null,"RGBW 24V Dimmer Tree","RGBW 24V Dimmer Tree","RGBW 24V Dimmer Tree","RGBW 24V Dimmer Tree","RGBW 24V Dimmer Tree","RGBW 24V Dimmer Tree","RGBW 24V Dimmer Tree","RGBW 24V Dimmer Tree","RGBW 24V Dimmer Tree","RGBW 24V Dimmer Tree","not translated yet","not translated yet","not translated yet","not translated yet","not translated yet","not translated yet","not translated yet",null,null,null,null,null,59.9,55,69,59.9,59.9,59.9,59.9,59.9,59.9,59.9,"Not done","Not done","Not done","Not done","Not done","Not done","Not done"]
[null,"Digital IN (Reserve)",null,null,null,null,"Digital IN (Reserve)",null,null,null,"Not done","Digital IN (Reserve)","Not done",null,null,null,"Digital IN (Reserve)",null,null,null,null,"Digital IN (Reserve)",null,null,null,null,"Digital IN (Reserve)",null,null,null,null,"Digital IN (Reserve)",null,null,null,"Not done","Digital IN (Reserve)","Not done",null,null,null,"Digital IN (Reserve)",null,null,null,null,"Digital IN (Reserve)",null,null,null,"Not done","not translated yet","Not done",null,null,"Not done","not translated yet","Not done",null,"Not done","not translated yet","Not done",null,null,"Not done","not translated yet","Not done",null,null,"Not done","not translated yet","Not done",null,null,"Not done","not translated yet","Not done",null,null,"Not done","not translated yet","Not done",null,null,null,null,null,null,null,null,184.0,"","","Not done","","","","","Not done","","","Not done","Not done","Not done","Not done","Not done","Not done","Not done",null,null,null,null,"Digital IN (Reserve)","Digital IN (Reserve)","Digital IN (Reserve)","Digital IN (Reserve)","Digital IN (Reserve)","Digital IN (Reserve)","Digital IN (Reserve)","Digital IN (Reserve)","Digital IN (Reserve)","Digital IN (Reserve)","not translated yet","not translated yet","not translated yet","not translated yet","not translated yet","not translated yet","not translated yet",null,null,null,null,null,"","","Not done","","","","","Not done","","","Not done","Not done","Not done","Not done","Not done","Not done","Not done"]
[null,"Analog IN (Reserve)",null,null,null,null,"Analog IN (Reserve)",null,null,null,"Not done","Analog IN (Reserve)","Not done",null,null,null,"Analog IN (Reserve)",null,null,null,null,"Analog IN (Reserve)",null,null,null,null,"Analog IN (Reserve)",null,null,null,null,"Analog IN (Reserve)",null,null,null,"Not done","Analog IN (Reserve)","Not done",null,null,null,"Analog IN (Reserve)",null,null,null,null,"Analog IN (Reserve)",null,null,null,"Not done","not translated yet","Not done",null,null,"Not done","not translated yet","Not done",null,"Not done","not translated yet","Not done",null,null,"Not done","not translated yet","Not done",null,null,"Not done","not translated yet","Not done",null,null,"Not done","not translated yet","Not done",null,null,"Not done","not translated yet","Not done",null,null,null,null,null,null,null,null,185.0,"","","Not done","","","","","Not done","","","Not done","Not done","Not done","Not done","Not done","Not done","Not done",null,null,null,null,"Analog IN (Reserve)","Analog IN (Reserve)","Analog IN (Reserve)","Analog IN (Reserve)","Analog IN (Reserve)","Analog IN (Reserve)","Analog IN (Reserve)","Analog IN (Reserve)","Analog IN (Reserve)","Analog IN (Reserve)","not translated yet","not translated yet","not translated yet","not translated yet","not translated yet","not translated yet","not translated yet",null,null,null,null,null,"","","Not done","","","","","Not done","","","Not done","Not done","Not done","Not done","Not done","Not done","Not done"]
[100177.0,"Fenstergriff Air",120.0,null,null,100177.0,"Window Handle Air",102.5,null,null,100177.0,"Window Handle Air",139.0,null,null,100177.0,"Poignée de fenêtre Air",120.0,null,null,100177.0,"Manilla Ventana Air",120.0,null,null,100177.0,"Okenní klika Air",3249.0,null,null,100177.0,"Maniglia finestra Air",120.0,null,null,100177.0,"Fenstergriff Air",166.66,null,null,100177.0,"Okenní klika Air",120.0,null,null,100177.0,"Vensterhandgreep Air",120.0,null,null,"Not done","not translated yet","Not done",null,null,"Not done","not translated yet","Not done",null,"Not done","not translated yet","Not done",null,null,"Not done","not translated yet","Not done",null,null,"Not done","not translated yet","Not done",null,null,"Not done","not translated yet","Not done",null,null,"Not done","not translated yet","Not done",null,null,null,null,null,null,null,null,186.0,100177,100177,100177,100177,100177,100177,100177,100177,100177,100177,"Not done","Not done","Not done","Not done","Not done","Not done","Not done",null,null,null,null,"Fenstergriff Air","Window Handle Air","Window Handle Air","Poignée de fenêtre Air","Manilla Ventana Air","Okenní klika Air","Maniglia finestra Air","Fenstergriff Air","Okenní klika Air","Vensterhandgreep Air","not translated yet","not translated yet","not translated yet","not translated yet","not translated yet","not translated yet","not translated yet",null,null,null,null,null,120,102.5,139,120,120,3249,120,166.66,120,120,"Not done","Not done","Not done","Not done","Not done","Not done","Not done"]
[null,null,null,null,null,null,null,null,null,null,"Not done","not translated yet","Not done",null,null,"Not done","not translated yet","Not done",null,null,null,"Translate from EN_UK or DE",null,null,null,null,"Translate from EN_UK or DE",null,null,null,null,"Translate from EN_UK or DE",null,null,null,"Not done","not translated yet","Not done",null,null,null,"Translate from EN_UK or DE",null,null,null,null,"Translate from EN_UK or DE",null,null,null,"Not done","not translated yet","Not done",null,null,"Not done","not translated yet","Not done",null,"Not done","not translated yet","Not done",null,null,"Not done","not translated yet","Not done",null,null,"Not done","not translated yet","Not done",null,null,"Not done","not translated yet","Not done",null,null,"Not done","not translated yet","Not done",null,null,null,null,null,null,null,null,187.0,"","","Not done","Not done","","","","Not done","","","Not done","Not done","Not done","Not done","Not done","Not done","Not done",null,null,null,null,"","","not translated yet","not translated yet","Translate from EN_UK or DE","Translate from EN_UK or DE","Translate from EN_UK or DE","not translated yet","Translate from EN_UK or DE","Translate from EN_UK or DE","not translated yet","not translated yet","not translated yet","not translated yet","not translated yet","not translated yet","not translated yet",null,null,null,null,null,"","","Not done","Not done","","","","Not done","","","Not done","Not done","Not done","Not done","Not done","Not done","Not done"]
[null,null,null,null,null,null,null,null,null,null,"Not done","not translated yet","Not done",null,null,"Not done","not translated yet","Not done",null,null,null,"Translate from EN_UK or DE",null,null,null,null,"Translate from EN_UK or DE",null,null,null,null,"Translate from EN_UK or DE",null,null,null,"Not done","not translated yet","Not done",null,null,null,"Translate from EN_UK or DE",null,null,null,null,"Translate from EN_UK or DE",null,null,null,"Not done","not translated yet","Not done",null,null,"Not done","not translated yet","Not done",null,"Not done","not translated yet","Not done",null,null,"Not done","not translated yet","Not done",null,null,"Not done","not translated yet","Not done",null,null,"Not done","not translated yet","Not done",null,null,"Not done","not translated yet","Not done",null,null,null,null,null,null,null,null,188.0,"","","Not done","Not done","","","","Not done","","","Not done","Not done","Not done","Not done","Not done","Not done","Not done",null,null,null,null,"","","not translated yet","not translated yet","Translate from EN_UK or DE","Translate from EN_UK or DE","Translate from EN_UK or DE","not translated yet","Translate from EN_UK or DE","Translate from EN_UK or DE","not translated yet","not translated yet","not translated yet","not translated yet","not translated yet","not translated yet","not translated yet",null,null,null,null,null,"","","Not done","Not done","","","","Not done","","","Not done","Not done","Not done","Not done","Not done","Not done","Not done"]
[null,null,null,null,null,null,null,null,null,null,"Not done","not translated yet","Not done",null,null,"Not done","not translated yet","Not done",null,null,null,"Translate from EN_UK or DE",null,null,null,null,"Translate from EN_UK or DE",null,null,null,null,"Translate from EN_UK or DE",null,null,null,"Not done","not translated yet","Not done",null,null,null,"Translate from EN_UK or DE",null,null,null,null,"Translate from EN_UK or DE",null,null,null,"Not done","not translated yet","Not done",null,null,"Not done","not translated yet","Not done",null,"Not done","not translated yet","Not done",null,null,"Not done","not translated yet","Not done",null,null,"Not done","not translated yet","Not done",null,null,"Not done","not translated yet","Not done",null,null,"Not done","not translated yet","Not done",null,null,null,null,null,null,null,null,189.0,"","","Not done","Not done","","","","Not done","","","Not done","Not done","Not done","Not done","Not done","Not done","Not done",null,null,null,null,"","","not translated yet","not translated yet","Translate from EN_UK or DE","Translate from EN_UK or DE","Translate from EN_UK or DE","not translated yet","Translate from EN_UK or DE","Translate from EN_UK or DE","not translated yet","not translated yet","not translated yet","not translated yet","not translated yet","not translated yet","not translated yet",null,null,null,null,null,"","","Not done","Not done","","","","Not done","","","Not done","Not done","Not done","Not done","Not done","Not done","Not done"]
[null,null,null,null,null,null,null,null,null,null,"Not done","not translated yet","Not done",null,null,"Not done","not translated yet","Not done",null,null,null,"Translate from EN_UK or DE",null,null,null,null,"Translate from EN_UK or DE",null,null,null,null,"Translate from EN_UK or DE",null,null,null,"Not done","not translated yet","Not done",null,null,null,"Translate from EN_UK or DE",null,null,null,null,"Translate from EN_UK or DE",null,null,null,"Not done","not translated yet","Not done",null,null,"Not done","not translated yet","Not done",null,"Not done","not translated yet","Not done",null,null,"Not done","not translated yet","Not done",null,null,"Not done","not translated yet","Not done",null,null,"Not done","not translated yet","Not done",null,null,"Not done","not translated yet","Not done",null,null,null,null,null,null,null,null,190.0,"","","Not done","Not done","","","","Not done","","","Not done","Not done","Not done","Not done","Not done","Not done","Not done",null,null,null,null,"","","not translated yet","not translated yet","Translate from EN_UK or DE","Translate from EN_UK or DE","Translate from EN_UK or DE","not translated yet","Translate from EN_UK or DE","Translate from EN_UK or DE","not translated yet","not translated yet","not translated yet","not translated yet","not translated yet","not translated yet","not translated yet",null,null,null,null,null,"","","Not done","Not done","","","","Not done","","","Not done","Not done","Not done","Not done","Not done","Not done","Not done"]
[null,null,null,null,null,null,null,null,null,null,"Not done","not translated yet","Not done",null,null,"Not done","not translated yet","Not done",null,null,null,"Translate from EN_UK or DE",null,null,null,null,"Translate from EN_UK or DE",null,null,null,null,"Translate from EN_UK or DE",null,null,null,"Not done","not translated yet","Not done",null,null,null,"Translate from EN_UK or DE",null,null,null,null,"Translate from EN_UK or DE",null,null,null,"Not done","not translated yet","Not done",null,null,"Not done","not translated yet","Not done",null,"Not done","not translated yet","Not done",null,null,"Not done","not translated yet","Not done",null,null,"Not done","not translated yet","Not done",null,null,"Not done","not translated yet","Not done",null,null,"Not done","not translated yet","Not done",null,null,null,null,null,null,null,null,191.0,"","","Not done","Not done","","","","Not done","","","Not done","Not done","Not done","Not done","Not done","Not done","Not done",null,null,null,null,"","","not translated yet","not translated yet","Translate from EN_UK or DE","Translate from EN_UK or DE","Translate from EN_UK or DE","not translated yet","Translate from EN_UK or DE","Translate from EN_UK or DE","not translated yet","not translated yet","not translated yet","not translated yet","not translated yet","not translated yet","not translated yet",null,null,null,null,null,"","","Not done","Not done","","","","Not done","","","Not done","Not done","Not done","Not done","Not done","Not done","Not done"]
[null,null,null,null,null,null,null,null,null,null,"Not done","not translated yet","Not done",null,null,"Not done","not translated yet","Not done",null,null,null,"Translate from EN_UK or DE",null,null,null,null,"Translate from EN_UK or DE",null,null,null,null,"Translate from EN_UK or DE",null,null,null,"Not done","not translated yet","Not done",null,null,null,"Translate from EN_UK or DE",null,null,null,null,"Translate from EN_UK or DE",null,null,null,"Not done","not translated yet","Not done",null,null,"Not done","not translated yet","Not done",null,"Not done","not translated yet","Not done",null,null,"Not done","not translated yet","Not done",null,null,"Not done","not translated yet","Not done",null,null,"Not done","not translated yet","Not done",null,null,"Not done","not translated yet","Not done",null,null,null,null,null,null,null,null,192.0,"","","Not done","Not done","","","","Not done","","","Not done","Not done","Not done","Not done","Not done","Not done","Not done",null,null,null,null,"","","not translated yet","not translated yet","Translate from EN_UK or DE","Translate from EN_UK or DE","Translate from EN_UK or DE","not translated yet","Translate from EN_UK or DE","Translate from EN_UK or DE","not translated yet","not translated yet","not translated yet","not translated yet","not translated yet","not translated yet","not translated yet",null,null,null,null,null,"","","Not done","Not done","","","","Not done","","","Not done","Not done","Not done","Not done","Not done","Not done","Not done"]
[null,null,null,null,null,null,null,null,null,null,"Not done","not translated yet","Not done",null,null,"Not done","not translated yet","Not done",null,null,null,"Translate from EN_UK or DE",null,null,null,null,"Translate from EN_UK or DE",null,null,null,null,"Translate from EN_UK or DE",null,null,null,"Not done","not translated yet","Not done",null,null,null,"Translate from EN_UK or DE",null,null,null,null,"Translate from EN_UK or DE",null,null,null,"Not done","not translated yet","Not done",null,null,"Not done","not translated yet","Not done",null,"Not done","not translated yet","Not done",null,null,"Not done","not translated yet","Not done",null,null,"Not done","not translated yet","Not done",null,null,"Not done","not translated yet","Not done",null,null,"Not done","not translated yet","Not done",null,null,null,null,null,null,null,null,193.0,"","","Not done","Not done","","","","Not done","","","Not done","Not done","Not done","Not done","Not done","Not done","Not done",null,null,null,null,"","","not translated yet","not translated yet","Translate from EN_UK or DE","Translate from EN_UK or DE","Translate from EN_UK or DE","not translated yet","Translate from EN_UK or DE","Translate from EN_UK or DE","not translated yet","not translated yet","not translated yet","not translated yet","not translated yet","not translated yet","not translated yet",null,null,null,null,null,"","","Not done","Not done","","","","Not done","","","Not done","Not done","Not done","Not done","Not done","Not done","Not done"]
[null,null,null,null,null,null,null,null,null,null,"Not done","not translated yet","Not done",null,null,"Not done","not translated yet","Not done",null,null,null,"Translate from EN_UK or DE",null,null,null,null,"Translate from EN_UK or DE",null,null,null,null,"Translate from EN_UK or DE",null,null,null,"Not done","not translated yet","Not done",null,null,null,"Translate from EN_UK or DE",null,null,null,null,"Translate from EN_UK or DE",null,null,null,"Not done","not translated yet","Not done",null,null,"Not done","not translated yet","Not done",null,"Not done","not translated yet","Not done",null,null,"Not done","not translated yet","Not done",null,null,"Not done","not translated yet","Not done",null,null,"Not done","not translated yet","Not done",null,null,"Not done","not translated yet","Not done",null,null,null,null,null,null,null,null,194.0,"","","Not done","Not done","","","","Not done","","","Not done","Not done","Not done","Not done","Not done","Not done","Not done",null,null,null,null,"","","not translated yet","not translated yet","Translate from EN_UK or DE","Translate from EN_UK or DE","Translate from EN_UK or DE","not translated yet","Translate from EN_UK or DE","Translate from EN_UK or DE","not translated yet","not translated yet","not translated yet","not translated yet","not translated yet","not translated yet","not translated yet",null,null,null,null,null,"","","Not done","Not done","","","","Not done","","","Not done","Not done","Not done","Not done","Not done","Not done","Not done"]
[null,null,null,null,null,null,null,null,null,null,"Not done","not translated yet","Not done",null,null,"Not done","not translated yet","Not done",null,null,null,"Translate from EN_UK or DE",null,null,null,null,"Translate from EN_UK or DE",null,null,null,null,"Translate from EN_UK or DE",null,null,null,"Not done","not translated yet","Not done",null,null,null,"Translate from EN_UK or DE",null,null,null,null,"Translate from EN_UK or DE",null,null,null,"Not done","not translated yet","Not done",null,null,"Not done","not translated yet","Not done",null,"Not done","not translated yet","Not done",null,null,"Not done","not translated yet","Not done",null,null,"Not done","not translated yet","Not done",null,null,"Not done","not translated yet","Not done",null,null,"Not done","not translated yet","Not done",null,null,null,null,null,null,null,null,195.0,"","","Not done","Not done","","","","Not done","","","Not done","Not done","Not done","Not done","Not done","Not done","Not done",null,null,null,null,"","","not translated yet","not translated yet","Translate from EN_UK or DE","Translate from EN_UK or DE","Translate from EN_UK or DE","not translated yet","Translate from EN_UK or DE","Translate from EN_UK or DE","not translated yet","not translated yet","not translated yet","not translated yet","not translated yet","not translated yet","not translated yet",null,null,null,null,null,"","","Not done","Not done","","","","Not done","","","Not done","Not done","Not done","Not done","Not done","Not done","Not done"]
[null,null,null,null,null,null,null,null,null,null,"Not done","not translated yet","Not done",null,null,"Not done","not translated yet","Not done",null,null,null,"Translate from EN_UK or DE",null,null,null,null,"Translate from EN_UK or DE",null,null,null,null,"Translate from EN_UK or DE",null,null,null,"Not done","not translated yet","Not done",null,null,null,"Translate from EN_UK or DE",null,null,null,null,"Translate from EN_UK or DE",null,null,null,"Not done","not translated yet","Not done",null,null,"Not done","not translated yet","Not done",null,"Not done","not translated yet","Not done",null,null,"Not done","not translated yet","Not done",null,null,"Not done","not translated yet","Not done",null,null,"Not done","not translated yet","Not done",null,null,"Not done","not translated yet","Not done",null,null,null,null,null,null,null,null,196.0,"","","Not done","Not done","","","","Not done","","","Not done","Not done","Not done","Not done","Not done","Not done","Not done",null,null,null,null,"","","not translated yet","not translated yet","Translate from EN_UK or DE","Translate from EN_UK or DE","Translate from EN_UK or DE","not translated yet","Translate from EN_UK or DE","Translate from EN_UK or DE","not translated yet","not translated yet","not translated yet","not translated yet","not translated yet","not translated yet","not translated yet",null,null,null,null,null,"","","Not done","Not done","","","","Not done","","","Not done","Not done","Not done","Not done","Not done","Not done","Not done"]
[null,null,null,null,null,null,null,null,null,null,"Not done","not translated yet","Not done",null,null,"Not done","not translated yet","Not done",null,null,null,"Translate from EN_UK or DE",null,null,null,null,"Translate from EN_UK or DE",null,null,null,null,"Translate from EN_UK or DE",null,null,null,"Not done","not translated yet","Not done",null,null,null,"Translate from EN_UK or DE",null,null,null,null,"Translate from EN_UK or DE",null,null,null,"Not done","not translated yet","Not done",null,null,"Not done","not translated yet","Not done",null,"Not done","not translated yet","Not done",null,null,"Not done","not translated yet","Not done",null,null,"Not done","not translated yet","Not done",null,null,"Not done","not translated yet","Not done",null,null,"Not done","not translated yet","Not done",null,null,null,null,null,null,null,null,197.0,"","","Not done","Not done","","","","Not done","","","Not done","Not done","Not done","Not done","Not done","Not done","Not done",null,null,null,null,"","","not translated yet","not translated yet","Translate from EN_UK or DE","Translate from EN_UK or DE","Translate from EN_UK or DE","not translated yet","Translate from EN_UK or DE","Translate from EN_UK or DE","not translated yet","not translated yet","not translated yet","not translated yet","not translated yet","not translated yet","not translated yet",null,null,null,null,null,"","","Not done","Not done","","","","Not done","","","Not done","Not done","Not done","Not done","Not done","Not done","Not done"]
[null,null,null,null,null,null,null,null,null,null,"Not done","not translated yet","Not done",null,null,"Not done","not translated yet","Not done",null,null,null,"Translate from EN_UK or DE",null,null,null,null,"Translate from EN_UK or DE",null,null,null,null,"Translate from EN_UK or DE",null,null,null,"Not done","not translated yet","Not done",null,null,null,"Translate from EN_UK or DE",null,null,null,null,"Translate from EN_UK or DE",null,null,null,"Not done","not translated yet","Not done",null,null,"Not done","not translated yet","Not done",null,"Not done","not translated yet","Not done",null,null,"Not done","not translated yet","Not done",null,null,"Not done","not translated yet","Not done",null,null,"Not done","not translated yet","Not done",null,null,"Not done","not translated yet","Not done",null,null,null,null,null,null,null,null,198.0,"","","Not done","Not done","","","","Not done","","","Not done","Not done","Not done","Not done","Not done","Not done","Not done",null,null,null,null,"","","not translated yet","not translated yet","Translate from EN_UK or DE","Translate from EN_UK or DE","Translate from EN_UK or DE","not translated yet","Translate from EN_UK or DE","Translate from EN_UK or DE","not translated yet","not translated yet","not translated yet","not translated yet","not translated yet","not translated yet","not translated yet",null,null,null,null,null,"","","Not done","Not done","","","","Not done","","","Not done","Not done","Not done","Not done","Not done","Not done","Not done"]
[null,null,null,null,null,null,null,null,null,null,"Not done","not translated yet","Not done",null,null,"Not done","not translated yet","Not done",null,null,null,"Translate from EN_UK or DE",null,null,null,null,"Translate from EN_UK or DE",null,null,null,null,"Translate from EN_UK or DE",null,null,null,"Not done","not translated yet","Not done",null,null,null,"Translate from EN_UK or DE",null,null,null,null,"Translate from EN_UK or DE",null,null,null,"Not done","not translated yet","Not done",null,null,"Not done","not translated yet","Not done",null,"Not done","not translated yet","Not done",null,null,"Not done","not translated yet","Not done",null,null,"Not done","not translated yet","Not done",null,null,"Not done","not translated yet","Not done",null,null,"Not done","not translated yet","Not done",null,null,null,null,null,null,null,null,199.0,"","","Not done","Not done","","","","Not done","","","Not done","Not done","Not done","Not done","Not done","Not done","Not done",null,null,null,null,"","","not translated yet","not translated yet","Translate from EN_UK or DE","Translate from EN_UK or DE","Translate from EN_UK or DE","not translated yet","Translate from EN_UK or DE","Translate from EN_UK or DE","not translated yet","not translated yet","not translated yet","not translated yet","not translated yet","not translated yet","not translated yet",null,null,null,null,null,"","","Not done","Not done","","","","Not done","","","Not done","Not done","Not done","Not done","Not done","Not done","Not done"]
[null,null,null,null,null,null,null,null,null,null,"Not done","not translated yet","Not done",null,null,"Not done","not translated yet","Not done",null,null,null,"Translate from EN_UK or DE",null,null,null,null,"Translate from EN_UK or DE",null,null,null,null,"Translate from EN_UK or DE",null,null,null,"Not done","not translated yet","Not done",null,null,null,"Translate from EN_UK or DE",null,null,null,null,"Translate from EN_UK or DE",null,null,null,"Not done","not translated yet","Not done",null,null,"Not done","not translated yet","Not done",null,"Not done","not translated yet","Not done",null,null,"Not done","not translated yet","Not done",null,null,"Not done","not translated yet","Not done",null,null,"Not done","not translated yet","Not done",null,null,"Not done","not translated yet","Not done",null,null,null,null,null,null,null,null,200.0,"","","Not done","Not done","","","","Not done","","","Not done","Not done","Not done","Not done","Not done","Not done","Not done",null,null,null,null,"","","not translated yet","not translated yet","Translate from EN_UK or DE","Translate from EN_UK or DE","Translate from EN_UK or DE","not translated yet","Translate from EN_UK or DE","Translate from EN_UK or DE","not translated yet","not translated yet","not translated yet","not translated yet","not translated yet","not translated yet","not translated yet",null,null,null,null,null,"","","Not done","Not done","","","","Not done","","","Not done","Not done","Not done","Not done","Not done","Not done","Not done"]
[null,null,null,null,null,null,null,null,null,null,"Not done","not translated yet","Not done",null,null,"Not done","not translated yet","Not done",null,null,null,"Translate from EN_UK or DE",null,null,null,null,"Translate from EN_UK or DE",null,null,null,null,"Translate from EN_UK or DE",null,null,null,"Not done","not translated yet","Not done",null,null,null,"Translate from EN_UK or DE",null,null,null,null,"Translate from EN_UK or DE",null,null,null,"Not done","not translated yet","Not done",null,null,"Not done","not translated yet","Not done",null,"Not done","not translated yet","Not done",null,null,"Not done","not translated yet","Not done",null,null,"Not done","not translated yet","Not done",null,null,"Not done","not translated yet","Not done",null,null,"Not done","not translated yet","Not done",null,null,null,null,null,null,null,null,201.0,"","","Not done","Not done","","","","Not done","","","Not done","Not done","Not done","Not done","Not done","Not done","Not done",null,null,null,null,"","","not translated yet","not translated yet","Translate from EN_UK or DE","Translate from EN_UK or DE","Translate from EN_UK or DE","not translated yet","Translate from EN_UK or DE","Translate from EN_UK or DE","not translated yet","not translated yet","not translated yet","not translated yet","not translated yet","not translated yet","not translated yet",null,null,null,null,null,"","","Not done","Not done","","","","Not done","","","Not done","Not done","Not done","Not done","Not done","Not done","Not done"]
[null,null,null,null,null,null,null,null,null,null,"Not done","not translated yet","Not done",null,null,"Not done","not translated yet","Not done",null,null,null,"Translate from EN_UK or DE",null,null,null,null,"Translate from EN_UK or DE",null,null,null,null,"Translate from EN_UK or DE",null,null,null,"Not done","not translated yet","Not done",null,null,null,"Translate from EN_UK or DE",null,null,null,null,"Translate from EN_UK or DE",null,null,null,"Not done","not translated yet","Not done",null,null,"Not done","not translated yet","Not done",null,"Not done","not translated yet","Not done",null,null,"Not done","not translated yet","Not done",null,null,"Not done","not translated yet","Not done",null,null,"Not done","not translated yet","Not done",null,null,"Not done","not translated yet","Not done",null,null,null,null,null,null,null,null,202.0,"","","Not done","Not done","","","","Not done","","","Not done","Not done","Not done","Not done","Not done","Not done","Not done",null,null,null,null,"","","not translated yet","not translated yet","Translate from EN_UK or DE","Translate from EN_UK or DE","Translate from EN_UK or DE","not translated yet","Translate from EN_UK or DE","Translate from EN_UK or DE","not translated yet","not translated yet","not translated yet","not translated yet","not translated yet","not translated yet","not translated yet",null,null,null,null,null,"","","Not done","Not done","","","","Not done","","","Not done","Not done","Not done","Not done","Not done","Not done","Not done"]
[null,null,null,null,null,null,null,null,null,null,"Not done","not translated yet","Not done",null,null,"Not done","not translated yet","Not done",null,null,null,"Translate from EN_UK or DE",null,null,null,null,"Translate from EN_UK or DE",null,null,null,null,"Translate from EN_UK or DE",null,null,null,"Not done","not translated yet","Not done",null,null,null,"Translate from EN_UK or DE",null,null,null,null,"Translate from EN_UK or DE",null,null,null,"Not done","not translated yet","Not done",null,null,"Not done","not translated yet","Not done",null,"Not done","not translated yet","Not done",null,null,"Not done","not translated yet","Not done",null,null,"Not done","not translated yet","Not done",null,null,"Not done","not translated yet","Not done",null,null,"Not done","not translated yet","Not done",null,null,null,null,null,null,null,null,203.0,"","","Not done","Not done","","","","Not done","","","Not done","Not done","Not done","Not done","Not done","Not done","Not done",null,null,null,null,"","","not translated yet","not translated yet","Translate from EN_UK or DE","Translate from EN_UK or DE","Translate from EN_UK or DE","not translated yet","Translate from EN_UK or DE","Translate from EN_UK or DE","not translated yet","not translated yet","not translated yet","not translated yet","not translated yet","not translated yet","not translated yet",null,null,null,null,null,"","","Not done","Not done","","","","Not done","","","Not done","Not done","Not done","Not done","Not done","Not done","Not done"]
[null,null,null,null,null,null,null,null,null,null,"Not done","not translated yet","Not done",null,null,"Not done","not translated yet","Not done",null,null,null,"Translate from EN_UK or DE",null,null,null,null,"Translate from EN_UK or DE",null,null,null,null,"Translate from EN_UK or DE",null,null,null,"Not done","not translated yet","Not done",null,null,null,"Translate from EN_UK or DE",null,null,null,null,"Translate from EN_UK or DE",null,null,null,"Not done","not translated yet","Not done",null,null,"Not done","not translated yet","Not done",null,"Not done","not translated yet","Not done",null,null,"Not done","not translated yet","Not done",null,null,"Not done","not translated yet","Not done",null,null,"Not done","not translated yet","Not done",null,null,"Not done","not translated yet","Not done",null,null,null,null,null,null,null,null,204.0,"","","Not done","Not done","","","","Not done","","","Not done","Not done","Not done","Not done","Not done","Not done","Not done",null,null,null,null,"","","not translated yet","not translated yet","Translate from EN_UK or DE","Translate from EN_UK or DE","Translate from EN_UK or DE","not translated yet","Translate from EN_UK or DE","Translate from EN_UK or DE","not translated yet","not translated yet","not translated yet","not translated yet","not translated yet","not translated yet","not translated yet",null,null,null,null,null,"","","Not done","Not done","","","","Not done","","","Not done","Not done","Not done","Not done","Not done","Not done","Not done"]
[null,null,null,null,null,null,null,null,null,null,"Not done","not translated yet","Not done",null,null,"Not done","not translated yet","Not done",null,null,null,"Translate from EN_UK or DE",null,null,null,null,"Translate from EN_UK or DE",null,null,null,null,"Translate from EN_UK or DE",null,null,null,"Not done","not translated yet","Not done",null,null,null,"Translate from EN_UK or DE",null,null,null,null,"Translate from EN_UK or DE",null,null,null,"Not done","not translated yet","Not done",null,null,"Not done","not translated yet","Not done",null,"Not done","not translated yet","Not done",null,null,"Not done","not translated yet","Not done",null,null,"Not done","not translated yet","Not done",null,null,"Not done","not translated yet","Not done",null,null,"Not done","not translated yet","Not done",null,null,null,null,null,null,null,null,205.0,"","","Not done","Not done","","","","Not done","","","Not done","Not done","Not done","Not done","Not done","Not done","Not done",null,null,null,null,"","","not translated yet","not translated yet","Translate from EN_UK or DE","Translate from EN_UK or DE","Translate from EN_UK or DE","not translated yet","Translate from EN_UK or DE","Translate from EN_UK or DE","not translated yet","not translated yet","not translated yet","not translated yet","not translated yet","not translated yet","not translated yet",null,null,null,null,null,"","","Not done","Not done","","","","Not done","","","Not done","Not done","Not done","Not done","Not done","Not done","Not done"]
[null,null,null,null,null,null,null,null,null,null,"Not done","not translated yet","Not done",null,null,"Not done","not translated yet","Not done",null,null,null,"Translate from EN_UK or DE",null,null,null,null,"Translate from EN_UK or DE",null,null,null,null,"Translate from EN_UK or DE",null,null,null,"Not done","not translated yet","Not done",null,null,null,"Translate from EN_UK or DE",null,null,null,null,"Translate from EN_UK or DE",null,null,null,"Not done","not translated yet","Not done",null,null,"Not done","not translated yet","Not done",null,"Not done","not translated yet","Not done",null,null,"Not done","not translated yet","Not done",null,null,"Not done","not translated yet","Not done",null,null,"Not done","not translated yet","Not done",null,null,"Not done","not translated yet","Not done",null,null,null,null,null,null,null,null,206.0,"","","Not done","Not done","","","","Not done","","","Not done","Not done","Not done","Not done","Not done","Not done","Not done",null,null,null,null,"","","not translated yet","not translated yet","Translate from EN_UK or DE","Translate from EN_UK or DE","Translate from EN_UK or DE","not translated yet","Translate from EN_UK or DE","Translate from EN_UK or DE","not translated yet","not translated yet","not translated yet","not translated yet","not translated yet","not translated yet","not translated yet",null,null,null,null,null,"","","Not done","Not done","","","","Not done","","","Not done","Not done","Not done","Not done","Not done","Not done","Not done"]
[null,null,null,null,null,null,null,null,null,null,"Not done","not translated yet","Not done",null,null,"Not done","not translated yet","Not done",null,null,null,"Translate from EN_UK or DE",null,null,null,null,"Translate from EN_UK or DE",null,null,null,null,"Translate from EN_UK or DE",null,null,null,"Not done","not translated yet","Not done",null,null,null,"Translate from EN_UK or DE",null,null,null,null,"Translate from EN_UK or DE",null,null,null,"Not done","not translated yet","Not done",null,null,"Not done","not translated yet","Not done",null,"Not done","not translated yet","Not done",null,null,"Not done","not translated yet","Not done",null,null,"Not done","not translated yet","Not done",null,null,"Not done","not translated yet","Not done",null,null,"Not done","not translated yet","Not done",null,null,null,null,null,null,null,null,207.0,"","","Not done","Not done","","","","Not done","","","Not done","Not done","Not done","Not done","Not done","Not done","Not done",null,null,null,null,"","","not translated yet","not translated yet","Translate from EN_UK or DE","Translate from EN_UK or DE","Translate from EN_UK or DE","not translated yet","Translate from EN_UK or DE","Translate from EN_UK or DE","not translated yet","not translated yet","not translated yet","not translated yet","not translated yet","not translated yet","not translated yet",null,null,null,null,null,"","","Not done","Not done","","","","Not done","","","Not done","Not done","Not done","Not done","Not done","Not done","Not done"]
[null,null,null,null,null,null,null,null,null,null,"Not done","not translated yet","Not done",null,null,"Not done","not translated yet","Not done",null,null,null,"Translate from EN_UK or DE",null,null,null,null,"Translate from EN_UK or DE",null,null,null,null,"Translate from EN_UK or DE",null,null,null,"Not done","not translated yet","Not done",null,null,null,"Translate from EN_UK or DE",null,null,null,null,"Translate from EN_UK or DE",null,null,null,"Not done","not translated yet","Not done",null,null,"Not done","not translated yet","Not done",null,"Not done","not translated yet","Not done",null,null,"Not done","not translated yet","Not done",null,null,"Not done","not translated yet","Not done",null,null,"Not done","not translated yet","Not done",null,null,"Not done","not translated yet","Not done",null,null,null,null,null,null,null,null,208.0,"","","Not done","Not done","","","","Not done","","","Not done","Not done","Not done","Not done","Not done","Not done","Not done",null,null,null,null,"","","not translated yet","not translated yet","Translate from EN_UK or DE","Translate from EN_UK or DE","Translate from EN_UK or DE","not translated yet","Translate from EN_UK or DE","Translate from EN_UK or DE","not translated yet","not translated yet","not translated yet","not translated yet","not translated yet","not translated yet","not translated yet",null,null,null,null,null,"","","Not done","Not done","","","","Not done","","","Not done","Not done","Not done","Not done","Not done","Not done","Not done"]
[null,null,null,null,null,null,null,null,null,null,"Not done","not translated yet","Not done",null,null,"Not done","not translated yet","Not done",null,null,null,"Translate from EN_UK or DE",null,null,null,null,"Translate from EN_UK or DE",null,null,null,null,"Translate from EN_UK or DE",null,null,null,"Not done","not translated yet","Not done",null,null,null,"Translate from EN_UK or DE",null,null,null,null,"Translate from EN_UK or DE",null,null,null,"Not done","not translated yet","Not done",null,null,"Not done","not translated yet","Not done",null,"Not done","not translated yet","Not done",null,null,"Not done","not translated yet","Not done",null,null,"Not done","not translated yet","Not done",null,null,"Not done","not translated yet","Not done",null,null,"Not done","not translated yet","Not done",null,null,null,null,null,null,null,null,209.0,"","","Not done","Not done","","","","Not done","","","Not done","Not done","Not done","Not done","Not done","Not done","Not done",null,null,null,null,"","","not translated yet","not translated yet","Translate from EN_UK or DE","Translate from EN_UK or DE","Translate from EN_UK or DE","not translated yet","Translate from EN_UK or DE","Translate from EN_UK or DE","not translated yet","not translated yet","not translated yet","not translated yet","not translated yet","not translated yet","not translated yet",null,null,null,null,null,"","","Not done","Not done","","","","Not done","","","Not done","Not done","Not done","Not done","Not done","Not done","Not done"]
[null,null,null,null,null,null,null,null,null,null,"Not done","not translated yet","Not done",null,null,"Not done","not translated yet","Not done",null,null,null,"Translate from EN_UK or DE",null,null,null,null,"Translate from EN_UK or DE",null,null,null,null,"Translate from EN_UK or DE",null,null,null,"Not done","not translated yet","Not done",null,null,null,"Translate from EN_UK or DE",null,null,null,null,"Translate from EN_UK or DE",null,null,null,"Not done","not translated yet","Not done",null,null,"Not done","not translated yet","Not done",null,"Not done","not translated yet","Not done",null,null,"Not done","not translated yet","Not done",null,null,"Not done","not translated yet","Not done",null,null,"Not done","not translated yet","Not done",null,null,"Not done","not translated yet","Not done",null,null,null,null,null,null,null,null,210.0,"","","Not done","Not done","","","","Not done","","","Not done","Not done","Not done","Not done","Not done","Not done","Not done",null,null,null,null,"","","not translated yet","not translated yet","Translate from EN_UK or DE","Translate from EN_UK or DE","Translate from EN_UK or DE","not translated yet","Translate from EN_UK or DE","Translate from EN_UK or DE","not translated yet","not translated yet","not translated yet","not translated yet","not translated yet","not translated yet","not translated yet",null,null,null,null,null,"","","Not done","Not done","","","","Not done","","","Not done","Not done","Not done","Not done","Not done","Not done","Not done"]
[null,null,null,null,null,null,null,null,null,null,"Not done","not translated yet","Not done",null,null,"Not done","not translated yet","Not done",null,null,null,"Translate from EN_UK or DE",null,null,null,null,"Translate from EN_UK or DE",null,null,null,null,"Translate from EN_UK or DE",null,null,null,"Not done","not translated yet","Not done",null,null,null,"Translate from EN_UK or DE",null,null,null,null,"Translate from EN_UK or DE",null,null,null,"Not done","not translated yet","Not done",null,null,"Not done","not translated yet","Not done",null,"Not done","not translated yet","Not done",null,null,"Not done","not translated yet","Not done",null,null,"Not done","not translated yet","Not done",null,null,"Not done","not translated yet","Not done",null,null,"Not done","not translated yet","Not done",null,null,null,null,null,null,null,null,211.0,"","","Not done","Not done","","","","Not done","","","Not done","Not done","Not done","Not done","Not done","Not done","Not done",null,null,null,null,"","","not translated yet","not translated yet","Translate from EN_UK or DE","Translate from EN_UK or DE","Translate from EN_UK or DE","not translated yet","Translate from EN_UK or DE","Translate from EN_UK or DE","not translated yet","not translated yet","not translated yet","not translated yet","not translated yet","not translated yet","not translated yet",null,null,null,null,null,"","","Not done","Not done","","","","Not done","","","Not done","Not done","Not done","Not done","Not done","Not done","Not done"]
[null,null,null,null,null,null,null,null,null,null,"Not done","not translated yet","Not done",null,null,"Not done","not translated yet","Not done",null,null,null,"Translate from EN_UK or DE",null,null,null,null,"Translate from EN_UK or DE",null,null,null,null,"Translate from EN_UK or DE",null,null,null,"Not done","not translated yet","Not done",null,null,null,"Translate from EN_UK or DE",null,null,null,null,"Translate from EN_UK or DE",null,null,null,"Not done","not translated yet","Not done",null,null,"Not done","not translated yet","Not done",null,"Not done","not translated yet","Not done",null,null,"Not done","not translated yet","Not done",null,null,"Not done","not translated yet","Not done",null,null,"Not done","not translated yet","Not done",null,null,"Not done","not translated yet","Not done",null,null,null,null,null,null,null,null,212.0,"","","Not done","Not done","","","","Not done","","","Not done","Not done","Not done","Not done","Not done","Not done","Not done",null,null,null,null,"","","not translated yet","not translated yet","Translate from EN_UK or DE","Translate from EN_UK or DE","Translate from EN_UK or DE","not translated yet","Translate from EN_UK or DE","Translate from EN_UK or DE","not translated yet","not translated yet","not translated yet","not translated yet","not translated yet","not translated yet","not translated yet",null,null,null,null,null,"","","Not done","Not done","","","","Not done","","","Not done","Not done","Not done","Not done","Not done","Not done","Not done"]
[null,null,null,null,null,null,null,null,null,null,"Not done","SPECIAL ITEMS US ONLY","Not done",null,null,"Not done","not translated yet","Not done",null,null,null,"Translate from EN_UK or DE",null,null,null,null,"Translate from EN_UK or DE",null,null,null,null,"Translate from EN_UK or DE",null,null,null,"Not done","not translated yet","Not done",null,null,null,"Translate from EN_UK or DE",null,null,null,null,"Translate from EN_UK or DE",null,null,null,"Not done","not translated yet","Not done",null,null,"Not done","not translated yet","Not done",null,"Not done","not translated yet","Not done",null,null,"Not done","not translated yet","Not done",null,null,"Not done","not translated yet","Not done",null,null,"Not done","not translated yet","Not done",null,null,"Not done","not translated yet","Not done",null,null,null,null,null,null,null,null,213.0,"","","Not done","Not done","","","","Not done","","","Not done","Not done","Not done","Not done","Not done","Not done","Not done",null,null,null,null,"","","SPECIAL ITEMS US ONLY","not translated yet","Translate from EN_UK or DE","Translate from EN_UK or DE","Translate from EN_UK or DE","not translated yet","Translate from EN_UK or DE","Translate from EN_UK or DE","not translated yet","not translated yet","not translated yet","not translated yet","not translated yet","not translated yet","not translated yet",null,null,null,null,null,"","","Not done","Not done","","","","Not done","","","Not done","Not done","Not done","Not done","Not done","Not done","Not done"]
[null,null,null,null,null,null,null,null,null,null,500000.0,"Wattstoper Single Push Button with LED",14.5]
[null,null,null,null,null,null,null,null,null,null,500001.0,"Wattstoper 2 Push Button with LED",14.5]
[null,null,null,null,null,null,null,null,null,null,500002.0,"Wattstoper 4 Push Button with LED",19.5]
[null,null,null,null,null,null,null,null,null,null,500003.0,"Wattstoper 8 Push Button with LED",39.0]
[null,null,null,null,null,null,null,null,null,null,500004.0,"Wattstoper Motion detector and Switch",68.0]
[null,null,null,null,null,null,null,null,null,null,500005.0,"Wattstoper Ceiling/Wall Motion Detector",79.0]
[null,null,null,null,null,null,null,null,null,null,"500033","Wattstoper Switch Cover Single Gang Plate",3.5]
[null,null,null,null,null,null,null,null,null,null,"500034","Wattstoper Switch Cover SDouble Gang Plate",7.0]